Geoff, the Geospatial Form and Function Vocabulary
type: Ontology
version IRI: geoff
imports: geosparql
license: http://creativecommons.org/licenses/by/4.0/
creator: ADAPT (TCD and DCU) and OSi
date: 2019/04/09
rights: Geoff, the Geospatial Form and Function Vocabulary is available under the CC 4.0 BY License; see http://creativecommons.org/licenses/by/4.0/. This license lets others distribute, remix, tweak, and build upon your work, even commercially, as long as they credit you for the original creation. For proper attribution, simply include the statement: "This work is based on the Geoff vocabulary, developed as a collaboration between the Knowledge and Data Engineering Group, Trinity College Dublin, Dublin City University and Ordnance Survey Ireland as part of the SFI ADAPT Centre (Grant 13/RC/2106)." and link back to the vocabulary's URL.
comment: This vocabulary defines the geospatial information systems concepts of form and function that may be applied to any geospatial feature to classify it or to further describe its shape and use. It extends the OGC geoSPARQL ontology by defining two new classes and two new properties that may be associated with a geoSPARQL geospatial Feature entity. Most forms and functions are highly relevant for the built environment but any geospatial entity may gain from having a form and/or a function associated with it.
version info: 1.02.006

has function
type: ObjectProperty
domain: Form
range: Function
comment: To relate a geospatial feature to its current function, which is drawn from list of individuals.

Artificial Surface
type: Class
subclass of: Form
subclass of: Restriction
  on property: has function
  some values from: ArtificialSurfaceFunction
comment: Artificial objects represent man-made ground cover such as Concrete, Tarmacadam, Gravel, Sloping Masonry and Rail Bed. Note that a garden is regarded as an Artificial Object. It also includes Runways, Ramps, etc. where these are not a part of a "Way".

Building Group
type: Class
subclass of: Building Structure

Building Single
type: Class
subclass of: Building Structure
comment: A Building is a human construction, designed for residence, shelter storage, or a business premises.

Building Structure
type: Class
subclass of: Structure
comment: A Building is a human construction, designed for residence, shelter storage, or a business premises.

Building Unit
type: Class
subclass of: Building Structure

Division Line
type: Class
subclass of: Form
subclass of: Restriction
  on property: has function
  some values from: DivisionLineFunction
comment: A Division is an erected or natural barrier between two areas, which may also act as a delimiter. More specifically a Division has a minimum height of 0.3m and a minimum length of 0.2m; or is a virtual barrier, or "open wall", representing the open side of a building.

Exposed Surface
type: Class
subclass of: Form
subclass of: Restriction
  on property: has function
  some values from: ExposedSurfaceFunction
comment: An exposed surface form is an area of ground surface that does not support vegetative growth - it is usually naturally occurring such as sand, mud or rock but may also be bare of vegetation due to human activity such as quarrying.

Form
type: Class
comment: Describes the physical composition of an object; what it actually is. All OSi features have a mandatory, non-null, Form value.

Abbey
type: Class
subclass of: NonFunctionForm
subclass of: Site
type: NamedIndividual
has function: Not Applicable
comment: A spatial feature with the shape Abbey

Courthouse Complex
type: Class
subclass of: NonFunctionForm
subclass of: Site
type: NamedIndividual
has function: Not Applicable
comment: A spatial feature with the shape Courthouse Complex

Crane
type: Class
subclass of: NonFunctionForm
subclass of: Structure
type: NamedIndividual
has function: Not Applicable
comment: A spatial feature with the shape Crane

Crane Rail
type: Class
subclass of: NonFunctionForm
subclass of: Structure
type: NamedIndividual
has function: Not Applicable
comment: A spatial feature with the shape Crane Rail

Crannog
type: Class
subclass of: Structure
subclass of: Restriction
  on property: hasForm
  some values from: StructureFunction
comment: A spatial feature with the shape of Crannog Structure

Cromlech
type: Class
subclass of: Structure
subclass of: Restriction
  on property: hasForm
  some values from: StructureFunction
comment: A spatial feature with the shape of Cromlech Structure

Dam
type: Class
subclass of: NonFunctionForm
subclass of: Structure
subclass of: Water
subclass of: Restriction
  on property: hasForm
  some values from: StructureFunction
type: NamedIndividual
has function: Not Applicable
comment: A spatial feature with the shape Dam
comment: A spatial feature with the shape of Dam Structure

Amusement Park
type: Class
subclass of: NonFunctionForm
subclass of: Site
type: NamedIndividual
has function: Not Applicable
comment: A spatial feature with the shape Amusement Park

Woodland Deciduous
type: Class
subclass of: Vegetation
subclass of: Restriction
  on property: hasForm
  some values from: VegetationFunction
comment: A spatial feature with the shape of Woodland Deciduous Vegetation

Detached Building
type: Class
subclass of: Building Single
subclass of: Restriction
  on property: hasForm
  some values from: BuildingSingleFunction
comment: A spatial feature with the shape of Detached Building BuildingSingle

Dock
type: Class
subclass of: NonFunctionForm
subclass of: Water
type: NamedIndividual
has function: Not Applicable
comment: A spatial feature with the shape Dock

Dog Racing Venue
type: Class
subclass of: NonFunctionForm
subclass of: Site
type: NamedIndividual
has function: Not Applicable
comment: A spatial feature with the shape Dog Racing Venue

Dolmen
type: Class
subclass of: Structure
subclass of: Restriction
  on property: hasForm
  some values from: StructureFunction
comment: A spatial feature with the shape of Dolmen Structure

Drain
type: Class
subclass of: NonFunctionForm
subclass of: Water
type: NamedIndividual
has function: Not Applicable
comment: A spatial feature with the shape Drain

Bridge Draw
type: Class
subclass of: Structure
subclass of: Restriction
  on property: hasForm
  some values from: StructureFunction
comment: A spatial feature with the shape of Bridge Draw Structure

Dual Carriageway
type: Class
subclass of: Way
subclass of: Restriction
  on property: hasForm
  some values from: WayFunction
comment: A spatial feature with the shape of Dual Carriageway Way

Park Enclosed
type: Class
subclass of: Site
subclass of: Restriction
  on property: hasForm
  some values from: SiteFunction
comment: A spatial feature with the shape of Park Enclosed Site

Enclosed Traffic Area
type: Class
subclass of: NonFunctionForm
subclass of: Way
type: NamedIndividual
has function: Not Applicable
comment: A spatial feature with the shape Enclosed Traffic Area

End of Rail
type: Class
subclass of: NonFunctionForm
subclass of: Rail Node
type: NamedIndividual
has function: Not Applicable
comment: A spatial feature with the shape End of Rail

End of Terrace
type: Class
subclass of: Building Single
subclass of: NonFunctionForm
subclass of: Restriction
  on property: hasForm
  some values from: BuildingSingleFunction
type: NamedIndividual
has function: Not Applicable
comment: A spatial feature with the shape End of Terrace
comment: A spatial feature with the shape of End of Terrace BuildingSingle

Entrance or Exit Car Park
type: Class
subclass of: NonFunctionForm
subclass of: Way
subclass of: Restriction
  on property: hasForm
  some values from: WayFunction
type: NamedIndividual
has function: Not Applicable
comment: A spatial feature with the shape Entrance or Exit Car Park
comment: A spatial feature with the shape of Entrance or Exit Car Park Way

Entrance or Exit Generic
type: Class
subclass of: NonFunctionForm
subclass of: Way
type: NamedIndividual
has function: Not Applicable
comment: A spatial feature with the shape Entrance or Exit Generic

Entrance or Exit Service Area
type: Class
subclass of: NonFunctionForm
subclass of: Way
type: NamedIndividual
has function: Not Applicable
comment: A spatial feature with the shape Entrance or Exit Service Area

Equestrian Centre
type: Class
subclass of: NonFunctionForm
subclass of: Site
type: NamedIndividual
has function: Not Applicable
comment: A spatial feature with the shape Equestrian Centre

Fence
type: Class
subclass of: Division Line
subclass of: Restriction
  on property: hasForm
  some values from: DivisionLineFunction
comment: A spatial feature with the shape of Fence DivisionLine

Ferry Line
type: Class
subclass of: Way
subclass of: Restriction
  on property: hasForm
  some values from: WayFunction
comment: A spatial feature with the shape of Ferry Line Way

Ferry Terminal
type: Class
subclass of: Building Single
subclass of: NonFunctionForm
type: NamedIndividual
has function: Not Applicable
comment: A spatial feature with the shape Ferry Terminal

Antiquity
type: Class
subclass of: Site
subclass of: Restriction
  on property: hasForm
  some values from: SiteFunction
comment: A spatial feature with the shape of Antiquity Site

Filling Station
type: Class
subclass of: Building Single
subclass of: NonFunctionForm
type: NamedIndividual
has function: Not Applicable
comment: A spatial feature with the shape Filling Station

Fire Station
type: Class
subclass of: Building Single
subclass of: NonFunctionForm
subclass of: Site
type: NamedIndividual
has function: Not Applicable
comment: A spatial feature with the shape Fire Station

Flat Rock
type: Class
subclass of: Exposed Surface
subclass of: NonFunctionForm
type: NamedIndividual
has function: Not Applicable
comment: A spatial feature with the shape Flat Rock

Apartment
type: Class
subclass of: Building Unit
subclass of: NonFunctionForm
type: NamedIndividual
has function: Not Applicable
comment: A spatial feature with the shape Apartment

Fountain
type: Class
subclass of: NonFunctionForm
subclass of: Structure
type: NamedIndividual
has function: Not Applicable
comment: A spatial feature with the shape Fountain

Friary
type: Class
subclass of: NonFunctionForm
subclass of: Site
type: NamedIndividual
has function: Not Applicable
comment: A spatial feature with the shape Friary

Gallops
type: Class
subclass of: NonFunctionForm
subclass of: Site
type: NamedIndividual
has function: Not Applicable
comment: A spatial feature with the shape Gallops

Garda Complex
type: Class
subclass of: NonFunctionForm
subclass of: Site
type: NamedIndividual
has function: Not Applicable
comment: A spatial feature with the shape Garda Complex

Garda Station
type: Class
subclass of: Building Single
subclass of: NonFunctionForm
type: NamedIndividual
has function: Not Applicable
comment: A spatial feature with the shape Garda Station

Apartment Building
type: Class
subclass of: Building Single
subclass of: NonFunctionForm
subclass of: Restriction
  on property: hasForm
  some values from: BuildingSingleFunction
type: NamedIndividual
has function: Not Applicable
comment: A spatial feature with the shape Apartment Building
comment: A spatial feature with the shape of Apartment Building BuildingSingle

Gas Complex
type: Class
subclass of: NonFunctionForm
subclass of: Site
type: NamedIndividual
has function: Not Applicable
comment: A spatial feature with the shape Gas Complex

Glasshouse
type: Class
subclass of: Building Single
subclass of: NonFunctionForm
type: NamedIndividual
has function: Not Applicable
comment: A spatial feature with the shape Glasshouse

Golf Course
type: Class
subclass of: Site
subclass of: Restriction
  on property: hasForm
  some values from: SiteFunction
comment: A spatial feature with the shape of Golf Course Site

Grass/Clay Surface
type: Class
subclass of: NonFunctionForm
subclass of: Vegetation
subclass of: Restriction
  on property: hasForm
  some values from: VegetationFunction
type: NamedIndividual
has function: Not Applicable
comment: A spatial feature with the shape Grass/Clay Surface
comment: A spatial feature with the shape of Grass/Clay Surface Vegetation

Government Complex
type: Class
subclass of: Site
subclass of: Restriction
  on property: hasForm
  some values from: SiteFunction
comment: A spatial feature with the shape of Government Complex Site

Grandstand
type: Class
subclass of: Building Single
subclass of: NonFunctionForm
type: NamedIndividual
has function: Not Applicable
comment: A spatial feature with the shape Grandstand

Handball Alley
type: Class
subclass of: NonFunctionForm
subclass of: Structure
type: NamedIndividual
has function: Not Applicable
comment: A spatial feature with the shape Handball Alley

Heath
type: Class
subclass of: NonFunctionForm
subclass of: Vegetation
type: NamedIndividual
has function: Not Applicable
comment: A spatial feature with the shape Heath

Hedge
type: Class
subclass of: Division Line
subclass of: Restriction
  on property: hasForm
  some values from: DivisionLineFunction
comment: A spatial feature with the shape of Hedge DivisionLine

Approach Light
type: Class
subclass of: NonFunctionForm
subclass of: Structure
type: NamedIndividual
has function: Not Applicable
comment: A spatial feature with the shape Approach Light

Heritage Park
type: Class
subclass of: NonFunctionForm
subclass of: Site
type: NamedIndividual
has function: Not Applicable
comment: A spatial feature with the shape Heritage Park

Holiday Centre
type: Class
subclass of: NonFunctionForm
subclass of: Site
type: NamedIndividual
has function: Not Applicable
comment: A spatial feature with the shape Holiday Centre

Hospital
type: Class
subclass of: Building Single
subclass of: Restriction
  on property: hasForm
  some values from: BuildingSingleFunction
comment: A spatial feature with the shape of Hospital BuildingSingle

Hospital Complex
type: Class
subclass of: Site
subclass of: Restriction
  on property: hasForm
  some values from: SiteFunction
comment: A spatial feature with the shape of Hospital Complex Site

Hotel
type: Class
subclass of: Building Single
subclass of: NonFunctionForm
type: NamedIndividual
has function: Not Applicable
comment: A spatial feature with the shape Hotel

Hotel Complex
type: Class
subclass of: NonFunctionForm
subclass of: Site
type: NamedIndividual
has function: Not Applicable
comment: A spatial feature with the shape Hotel Complex

Interchange
type: Class
subclass of: NonFunctionForm
subclass of: Site
type: NamedIndividual
has function: Not Applicable
comment: A spatial feature with the shape Interchange

Lake Intersecting Point
type: Class
subclass of: NonFunctionForm
subclass of: Water
type: NamedIndividual
has function: Not Applicable
comment: A spatial feature with the shape Lake Intersecting Point

Jetty
type: Class
subclass of: NonFunctionForm
subclass of: Structure
type: NamedIndividual
has function: Not Applicable
comment: A spatial feature with the shape Jetty

Lake
type: Class
subclass of: NonFunctionForm
subclass of: Water
subclass of: Restriction
  on property: hasForm
  some values from: WaterFunction
type: NamedIndividual
has function: Not Applicable
comment: A spatial feature with the shape Lake
comment: A spatial feature with the shape of Lake Water

Landfill
type: Class
subclass of: NonFunctionForm
subclass of: Site
type: NamedIndividual
has function: Not Applicable
comment: A spatial feature with the shape Landfill

Landform
type: Class
subclass of: Structure
subclass of: Restriction
  on property: hasForm
  some values from: StructureFunction
comment: A spatial feature with the shape of Landform Structure

Aquatic Centre
type: Class
subclass of: Building Single
subclass of: NonFunctionForm
type: NamedIndividual
has function: Not Applicable
comment: A spatial feature with the shape Aquatic Centre

Landform Line
type: Class
subclass of: Structure
subclass of: Restriction
  on property: hasForm
  some values from: StructureFunction
comment: A spatial feature with the shape of Landform Line Structure

Leisure Complex
type: Class
subclass of: Site
subclass of: Restriction
  on property: hasForm
  some values from: SiteFunction
comment: A spatial feature with the shape of Leisure Complex Site

Level Crossing
type: Class
subclass of: NonFunctionForm
subclass of: Rail Node
subclass of: Way
subclass of: Restriction
  on property: hasForm
  some values from: WayFunction
type: NamedIndividual
has function: Not Applicable
comment: A spatial feature with the shape Level Crossing
comment: A spatial feature with the shape of Level Crossing Way

Library
type: Class
subclass of: NonFunctionForm
subclass of: Site
type: NamedIndividual
has function: Not Applicable
comment: A spatial feature with the shape Library

Lifeboat Station
type: Class
subclass of: Building Single
subclass of: NonFunctionForm
type: NamedIndividual
has function: Not Applicable
comment: A spatial feature with the shape Lifeboat Station

Lighthouse
type: Class
subclass of: Building Single
subclass of: NonFunctionForm
type: NamedIndividual
has function: Not Applicable
comment: A spatial feature with the shape Lighthouse

Lock Gate
type: Class
subclass of: NonFunctionForm
subclass of: Structure
type: NamedIndividual
has function: Not Applicable
comment: A spatial feature with the shape Lock Gate

Mansion
type: Class
subclass of: Building Single
subclass of: NonFunctionForm
type: NamedIndividual
has function: Not Applicable
comment: A spatial feature with the shape Mansion

Manufacturing Unit
type: Class
subclass of: Building Unit
subclass of: NonFunctionForm
type: NamedIndividual
has function: Not Applicable
comment: A spatial feature with the shape Manufacturing Unit

Marsh
type: Class
subclass of: NonFunctionForm
subclass of: Vegetation
type: NamedIndividual
has function: Not Applicable
comment: A spatial feature with the shape Marsh

Tower Martello
type: Class
subclass of: Building Single
subclass of: Restriction
  on property: hasForm
  some values from: BuildingSingleFunction
comment: A spatial feature with the shape of Tower Martello BuildingSingle

Mast
type: Class
subclass of: NonFunctionForm
subclass of: Structure
type: NamedIndividual
has function: Not Applicable
comment: A spatial feature with the shape Mast

Archway
type: Class
subclass of: NonFunctionForm
subclass of: Structure
type: NamedIndividual
has function: Not Applicable
comment: A spatial feature with the shape Archway

Megalithic Tomb
type: Class
subclass of: Structure
subclass of: Restriction
  on property: hasForm
  some values from: StructureFunction
comment: A spatial feature with the shape of Megalithic Tomb Structure

Mile Post
type: Class
subclass of: NonFunctionForm
subclass of: Rail Node
type: NamedIndividual
has function: Not Applicable
comment: A spatial feature with the shape Mile Post

Mill
type: Class
subclass of: Building Single
subclass of: NonFunctionForm
type: NamedIndividual
has function: Not Applicable
comment: A spatial feature with the shape Mill

Mill Race
type: Class
subclass of: NonFunctionForm
subclass of: Water
type: NamedIndividual
has function: Not Applicable
comment: A spatial feature with the shape Mill Race

Woodland Mixed
type: Class
subclass of: Vegetation
subclass of: Restriction
  on property: hasForm
  some values from: VegetationFunction
comment: A spatial feature with the shape of Woodland Mixed Vegetation

Monastery
type: Class
subclass of: Building Single
subclass of: NonFunctionForm
subclass of: Site
type: NamedIndividual
has function: Not Applicable
comment: A spatial feature with the shape Monastery

Monument
type: Class
subclass of: NonFunctionForm
subclass of: Structure
subclass of: Restriction
  on property: hasForm
  some values from: StructureFunction
type: NamedIndividual
has function: Not Applicable
comment: A spatial feature with the shape Monument
comment: A spatial feature with the shape of Monument Structure

Mooring Post
type: Class
subclass of: NonFunctionForm
subclass of: Structure
type: NamedIndividual
has function: Not Applicable
comment: A spatial feature with the shape Mooring Post

Mosque
type: Class
subclass of: Building Single
subclass of: NonFunctionForm
type: NamedIndividual
has function: Not Applicable
comment: A spatial feature with the shape Mosque

Motor Racing Circuit
type: Class
subclass of: NonFunctionForm
subclass of: Site
type: NamedIndividual
has function: Not Applicable
comment: A spatial feature with the shape Motor Racing Circuit

Motorway
type: Class
subclass of: Way
subclass of: Restriction
  on property: hasForm
  some values from: WayFunction
comment: A spatial feature with the shape of Motorway Way

Mud
type: Class
subclass of: Exposed Surface
subclass of: NonFunctionForm
type: NamedIndividual
has function: Not Applicable
comment: A spatial feature with the shape Mud

Multiple Use
type: Class
subclass of: NonFunctionForm
subclass of: Site
type: NamedIndividual
has function: Not Applicable
comment: A spatial feature with the shape Multiple Use

Multi-Storey Car park
type: Class
subclass of: Building Single
subclass of: NonFunctionForm
type: NamedIndividual
has function: Not Applicable
comment: A spatial feature with the shape Multi-Storey Car park

Museum
type: Class
subclass of: NonFunctionForm
subclass of: Site
type: NamedIndividual
has function: Not Applicable
comment: A spatial feature with the shape Museum

Naval Base
type: Class
subclass of: NonFunctionForm
subclass of: Site
type: NamedIndividual
has function: Not Applicable
comment: A spatial feature with the shape Naval Base

Army Barracks
type: Class
subclass of: NonFunctionForm
subclass of: Site
type: NamedIndividual
has function: Not Applicable
comment: A spatial feature with the shape Army Barracks

Navigational Post/Beacon
type: Class
subclass of: NonFunctionForm
subclass of: Structure
type: NamedIndividual
has function: Not Applicable
comment: A spatial feature with the shape Navigational Post/Beacon

Nursery
type: Class
subclass of: NonFunctionForm
subclass of: Site
subclass of: Vegetation
type: NamedIndividual
has function: Not Applicable
comment: A spatial feature with the shape Nursery

Nursing Home
type: Class
subclass of: NonFunctionForm
subclass of: Site
type: NamedIndividual
has function: Not Applicable
comment: A spatial feature with the shape Nursing Home

Observatory
type: Class
subclass of: Building Single
subclass of: NonFunctionForm
type: NamedIndividual
has function: Not Applicable
comment: A spatial feature with the shape Observatory

Office Unit
type: Class
subclass of: Building Unit
subclass of: NonFunctionForm
type: NamedIndividual
has function: Not Applicable
comment: A spatial feature with the shape Office Unit

Oil Depot
type: Class
subclass of: NonFunctionForm
subclass of: Site
type: NamedIndividual
has function: Not Applicable
comment: A spatial feature with the shape Oil Depot

Pier Open
type: Class
subclass of: NonFunctionForm
subclass of: Structure
type: NamedIndividual
has function: Not Applicable
comment: A spatial feature with the shape Pier Open

Open Terrace
type: Class
subclass of: NonFunctionForm
subclass of: Structure
type: NamedIndividual
has function: Not Applicable
comment: A spatial feature with the shape Open Terrace

Orchard
type: Class
subclass of: NonFunctionForm
subclass of: Vegetation
type: NamedIndividual
has function: Not Applicable
comment: A spatial feature with the shape Orchard

Outcrop
type: Class
subclass of: Exposed Surface
subclass of: NonFunctionForm
type: NamedIndividual
has function: Not Applicable
comment: A spatial feature with the shape Outcrop

Powerline Overhead Electricity
type: Class
subclass of: Service Line
subclass of: Restriction
  on property: hasForm
  some values from: ServiceLineFunction
comment: A spatial feature with the shape of Powerline Overhead Electricity ServiceLine

Pipeline Overhead
type: Class
subclass of: Service Line
subclass of: Restriction
  on property: hasForm
  some values from: ServiceLineFunction
comment: A spatial feature with the shape of Pipeline Overhead ServiceLine

Athletic Complex
type: Class
subclass of: NonFunctionForm
subclass of: Site
type: NamedIndividual
has function: Not Applicable
comment: A spatial feature with the shape Athletic Complex

Pier Solid
type: Class
subclass of: NonFunctionForm
subclass of: Structure
type: NamedIndividual
has function: Not Applicable
comment: A spatial feature with the shape Pier Solid

Pit
type: Class
subclass of: Exposed Surface
subclass of: Restriction
  on property: hasForm
  some values from: ExposedSurfaceFunction
comment: A spatial feature with the shape of Pit ExposedSurface

Pole
type: Class
subclass of: Structure
subclass of: Restriction
  on property: hasForm
  some values from: StructureFunction
comment: A spatial feature with the shape of Pole Structure

Athletic Track
type: Class
subclass of: NonFunctionForm
subclass of: Site
type: NamedIndividual
has function: Not Applicable
comment: A spatial feature with the shape Athletic Track

Port Complex
type: Class
subclass of: NonFunctionForm
subclass of: Site
type: NamedIndividual
has function: Not Applicable
comment: A spatial feature with the shape Port Complex

Power Station Complex
type: Class
subclass of: NonFunctionForm
subclass of: Site
type: NamedIndividual
has function: Not Applicable
comment: A spatial feature with the shape Power Station Complex

Prison
type: Class
subclass of: Building Single
subclass of: Restriction
  on property: hasForm
  some values from: BuildingSingleFunction
comment: A spatial feature with the shape of Prison BuildingSingle

Prison Complex
type: Class
subclass of: Site
subclass of: Restriction
  on property: hasForm
  some values from: SiteFunction
comment: A spatial feature with the shape of Prison Complex Site

Pylon
type: Class
subclass of: NonFunctionForm
subclass of: Structure
type: NamedIndividual
has function: Not Applicable
comment: A spatial feature with the shape Pylon

Quarry
type: Class
subclass of: Exposed Surface
subclass of: NonFunctionForm
subclass of: Site
subclass of: Restriction
  on property: hasForm
  some values from: ExposedSurfaceFunction
type: NamedIndividual
has function: Not Applicable
comment: A spatial feature with the shape Quarry
comment: A spatial feature with the shape of Quarry ExposedSurface

Adventure Centre
type: Class
subclass of: NonFunctionForm
subclass of: Site
type: NamedIndividual
has function: Not Applicable
comment: A spatial feature with the shape Adventure Centre

Bank
type: Class
subclass of: Division Line
subclass of: Restriction
  on property: hasForm
  some values from: DivisionLineFunction
comment: A spatial feature with the shape of Bank DivisionLine

Race Course
type: Class
subclass of: NonFunctionForm
subclass of: Site
type: NamedIndividual
has function: Not Applicable
comment: A spatial feature with the shape Race Course

Race Track
type: Class
subclass of: NonFunctionForm
subclass of: Site
type: NamedIndividual
has function: Not Applicable
comment: A spatial feature with the shape Race Track

Rail Platform
type: Class
subclass of: NonFunctionForm
subclass of: Structure
type: NamedIndividual
has function: Not Applicable
comment: A spatial feature with the shape Rail Platform

Rail Switch
type: Class
subclass of: NonFunctionForm
subclass of: Rail Node
type: NamedIndividual
has function: Not Applicable
comment: A spatial feature with the shape Rail Switch

Railing
type: Class
subclass of: Division Line
subclass of: Restriction
  on property: hasForm
  some values from: DivisionLineFunction
comment: A spatial feature with the shape of Railing DivisionLine

Barrack
type: Class
subclass of: Building Single
subclass of: Restriction
  on property: hasForm
  some values from: BuildingSingleFunction
comment: A spatial feature with the shape of Barrack BuildingSingle

Railway Signal Box
type: Class
subclass of: Building Single
subclass of: NonFunctionForm
type: NamedIndividual
has function: Not Applicable
comment: A spatial feature with the shape Railway Signal Box

Railway Station
type: Class
subclass of: Building Single
subclass of: NonFunctionForm
subclass of: Site
subclass of: Restriction
  on property: hasForm
  some values from: BuildingSingleFunction
type: NamedIndividual
has function: Not Applicable
comment: A spatial feature with the shape Railway Station
comment: A spatial feature with the shape of Railway Station BuildingSingle

Recycling Centre
type: Class
subclass of: NonFunctionForm
subclass of: Site
type: NamedIndividual
has function: Not Applicable
comment: A spatial feature with the shape Recycling Centre

Recycling Plant
type: Class
subclass of: NonFunctionForm
subclass of: Site
type: NamedIndividual
has function: Not Applicable
comment: A spatial feature with the shape Recycling Plant

River
type: Class
subclass of: Water
subclass of: Restriction
  on property: hasForm
  some values from: WaterFunction
comment: A spatial feature with the shape of River Water

Rock Face
type: Class
subclass of: Exposed Surface
subclass of: Structure
subclass of: Restriction
  on property: hasForm
  some values from: ExposedSurfaceFunction
subclass of: Restriction
  on property: hasForm
  some values from: StructureFunction
comment: A spatial feature with the shape of Rock Face ExposedSurface
comment: A spatial feature with the shape of Rock Face Structure

Tower Round
type: Class
subclass of: Building Single
subclass of: NonFunctionForm
type: NamedIndividual
has function: Not Applicable
comment: A spatial feature with the shape Tower Round

Roundabout
type: Class
subclass of: NonFunctionForm
subclass of: Way
subclass of: Restriction
  on property: hasForm
  some values from: WayFunction
type: NamedIndividual
has function: Not Applicable
comment: A spatial feature with the shape Roundabout
comment: A spatial feature with the shape of Roundabout Way

Ruin
type: Class
subclass of: Site
subclass of: Structure
subclass of: Restriction
  on property: hasForm
  some values from: SiteFunction
subclass of: Restriction
  on property: hasForm
  some values from: StructureFunction
comment: A spatial feature with the shape of Ruin Site
comment: A spatial feature with the shape of Ruin Structure

Runway
type: Class
subclass of: NonFunctionForm
subclass of: Way
type: NamedIndividual
has function: Not Applicable
comment: A spatial feature with the shape Runway

Salt Marsh
type: Class
subclass of: NonFunctionForm
subclass of: Vegetation
type: NamedIndividual
has function: Not Applicable
comment: A spatial feature with the shape Salt Marsh

Sand
type: Class
subclass of: Exposed Surface
subclass of: NonFunctionForm
type: NamedIndividual
has function: Not Applicable
comment: A spatial feature with the shape Sand

Sand and Shingle
type: Class
subclass of: Exposed Surface
subclass of: NonFunctionForm
type: NamedIndividual
has function: Not Applicable
comment: A spatial feature with the shape Sand and Shingle

Sand Dune
type: Class
subclass of: Exposed Surface
subclass of: NonFunctionForm
type: NamedIndividual
has function: Not Applicable
comment: A spatial feature with the shape Sand Dune

School
type: Class
subclass of: Building Single
subclass of: Site
subclass of: Restriction
  on property: hasForm
  some values from: BuildingSingleFunction
subclass of: Restriction
  on property: hasForm
  some values from: SiteFunction
comment: A spatial feature with the shape of School BuildingSingle
comment: A spatial feature with the shape of School Site

Scrub
type: Class
subclass of: NonFunctionForm
subclass of: Vegetation
subclass of: Restriction
  on property: hasForm
  some values from: VegetationFunction
type: NamedIndividual
has function: Not Applicable
comment: A spatial feature with the shape Scrub
comment: A spatial feature with the shape of Scrub Vegetation

Semi-Detached Building
type: Class
subclass of: Building Single
subclass of: Restriction
  on property: hasForm
  some values from: BuildingSingleFunction
comment: A spatial feature with the shape of Semi-Detached Building BuildingSingle

Service Area
type: Class
subclass of: NonFunctionForm
subclass of: Site
type: NamedIndividual
has function: Not Applicable
comment: A spatial feature with the shape Service Area

Service Road
type: Class
subclass of: Way
subclass of: Restriction
  on property: hasForm
  some values from: WayFunction
comment: A spatial feature with the shape of Service Road Way

Serviced Halting Site
type: Class
subclass of: NonFunctionForm
subclass of: Site
type: NamedIndividual
has function: Not Applicable
comment: A spatial feature with the shape Serviced Halting Site

Sewage Plant Complex
type: Class
subclass of: NonFunctionForm
subclass of: Site
type: NamedIndividual
has function: Not Applicable
comment: A spatial feature with the shape Sewage Plant Complex

Shingle
type: Class
subclass of: Exposed Surface
subclass of: NonFunctionForm
type: NamedIndividual
has function: Not Applicable
comment: A spatial feature with the shape Shingle

Baths
type: Class
subclass of: Structure
subclass of: Restriction
  on property: hasForm
  some values from: StructureFunction
comment: A spatial feature with the shape of Baths Structure

Shooting Range
type: Class
subclass of: Site
subclass of: Restriction
  on property: hasForm
  some values from: SiteFunction
comment: A spatial feature with the shape of Shooting Range Site

Shop
type: Class
subclass of: Building Single
subclass of: NonFunctionForm
type: NamedIndividual
has function: Not Applicable
comment: A spatial feature with the shape Shop

Shop Unit
type: Class
subclass of: Building Unit
subclass of: NonFunctionForm
type: NamedIndividual
has function: Not Applicable
comment: A spatial feature with the shape Shop Unit

Shopping Centre
type: Class
subclass of: Building Single
subclass of: NonFunctionForm
type: NamedIndividual
has function: Not Applicable
comment: A spatial feature with the shape Shopping Centre

Shopping Complex
type: Class
subclass of: NonFunctionForm
subclass of: Site
type: NamedIndividual
has function: Not Applicable
comment: A spatial feature with the shape Shopping Complex

Showground
type: Class
subclass of: NonFunctionForm
subclass of: Site
type: NamedIndividual
has function: Not Applicable
comment: A spatial feature with the shape Showground

Tower Signal
type: Class
subclass of: Building Single
subclass of: NonFunctionForm
type: NamedIndividual
has function: Not Applicable
comment: A spatial feature with the shape Tower Signal

Single Carriageway
type: Class
subclass of: Way
subclass of: Restriction
  on property: hasForm
  some values from: WayFunction
comment: A spatial feature with the shape of Single Carriageway Way

Ski Slope
type: Class
subclass of: NonFunctionForm
subclass of: Site
type: NamedIndividual
has function: Not Applicable
comment: A spatial feature with the shape Ski Slope

Sliproad
type: Class
subclass of: Way
subclass of: Restriction
  on property: hasForm
  some values from: WayFunction
comment: A spatial feature with the shape of Sliproad Way

Sluice
type: Class
subclass of: NonFunctionForm
subclass of: Water
type: NamedIndividual
has function: Not Applicable
comment: A spatial feature with the shape Sluice

Sluice Gate
type: Class
subclass of: Structure
subclass of: Restriction
  on property: hasForm
  some values from: StructureFunction
comment: A spatial feature with the shape of Sluice Gate Structure

Souterrain
type: Class
subclass of: Structure
subclass of: Restriction
  on property: hasForm
  some values from: StructureFunction
comment: A spatial feature with the shape of Souterrain Structure

Sports Ground
type: Class
subclass of: Site
subclass of: Restriction
  on property: hasForm
  some values from: SiteFunction
comment: A spatial feature with the shape of Sports Ground Site

Sports Stadium
type: Class
subclass of: Site
subclass of: Restriction
  on property: hasForm
  some values from: SiteFunction
comment: A spatial feature with the shape of Sports Stadium Site

Baulk
type: Class
subclass of: Division Line
subclass of: NonFunctionForm
type: NamedIndividual
has function: Not Applicable
comment: A spatial feature with the shape Baulk

Stable
type: Class
subclass of: Building Single
subclass of: NonFunctionForm
type: NamedIndividual
has function: Not Applicable
comment: A spatial feature with the shape Stable

Stadium
type: Class
subclass of: Building Single
subclass of: NonFunctionForm
type: NamedIndividual
has function: Not Applicable
comment: A spatial feature with the shape Stadium

Stand
type: Class
subclass of: NonFunctionForm
subclass of: Structure
type: NamedIndividual
has function: Not Applicable
comment: A spatial feature with the shape Stand

Standing Stone
type: Class
subclass of: Structure
subclass of: Restriction
  on property: hasForm
  some values from: StructureFunction
comment: A spatial feature with the shape of Standing Stone Structure

State Government Building
type: Class
subclass of: Building Single
subclass of: NonFunctionForm
type: NamedIndividual
has function: Not Applicable
comment: A spatial feature with the shape State Government Building

Steps
type: Class
subclass of: NonFunctionForm
subclass of: Structure
type: NamedIndividual
has function: Not Applicable
comment: A spatial feature with the shape Steps

Stone Circle
type: Class
subclass of: Structure
subclass of: Restriction
  on property: hasForm
  some values from: StructureFunction
comment: A spatial feature with the shape of Stone Circle Structure

Storage Unit
type: Class
subclass of: Building Unit
subclass of: NonFunctionForm
type: NamedIndividual
has function: Not Applicable
comment: A spatial feature with the shape Storage Unit

Stream
type: Class
subclass of: NonFunctionForm
subclass of: Water
type: NamedIndividual
has function: Not Applicable
comment: A spatial feature with the shape Stream

Stud Farm
type: Class
subclass of: NonFunctionForm
subclass of: Site
type: NamedIndividual
has function: Not Applicable
comment: A spatial feature with the shape Stud Farm

Swimming Pool
type: Class
subclass of: NonFunctionForm
subclass of: Structure
type: NamedIndividual
has function: Not Applicable
comment: A spatial feature with the shape Swimming Pool

Tank
type: Class
subclass of: Structure
subclass of: Restriction
  on property: hasForm
  some values from: StructureFunction
comment: A spatial feature with the shape of Tank Structure

Taxiway
type: Class
subclass of: NonFunctionForm
subclass of: Way
type: NamedIndividual
has function: Not Applicable
comment: A spatial feature with the shape Taxiway

Telecommunication Complex
type: Class
subclass of: NonFunctionForm
subclass of: Site
type: NamedIndividual
has function: Not Applicable
comment: A spatial feature with the shape Telecommunication Complex

Telephone Point
type: Class
subclass of: Structure
subclass of: Restriction
  on property: hasForm
  some values from: StructureFunction
comment: A spatial feature with the shape of Telephone Point Structure

Terrace
type: Class
subclass of: Building Group
subclass of: NonFunctionForm
type: NamedIndividual
has function: Not Applicable
comment: A spatial feature with the shape Terrace

Terraced Building
type: Class
subclass of: Building Single
subclass of: Restriction
  on property: hasForm
  some values from: BuildingSingleFunction
comment: A spatial feature with the shape of Terraced Building BuildingSingle

Theatre Complex
type: Class
subclass of: NonFunctionForm
subclass of: Site
type: NamedIndividual
has function: Not Applicable
comment: A spatial feature with the shape Theatre Complex

River Tidal
type: Class
subclass of: NonFunctionForm
subclass of: Water
type: NamedIndividual
has function: Not Applicable
comment: A spatial feature with the shape River Tidal

Toilet
type: Class
subclass of: Building Single
subclass of: NonFunctionForm
type: NamedIndividual
has function: Not Applicable
comment: A spatial feature with the shape Toilet

Belfry
type: Class
subclass of: Building Single
subclass of: NonFunctionForm
type: NamedIndividual
has function: Not Applicable
comment: A spatial feature with the shape Belfry

Toll Booth
type: Class
subclass of: Building Single
subclass of: NonFunctionForm
type: NamedIndividual
has function: Not Applicable
comment: A spatial feature with the shape Toll Booth

Toll Plaza
type: Class
subclass of: Way
subclass of: Restriction
  on property: hasForm
  some values from: WayFunction
comment: A spatial feature with the shape of Toll Plaza Way

Tower General
type: Class
subclass of: Building Single
subclass of: Restriction
  on property: hasForm
  some values from: BuildingSingleFunction
comment: A spatial feature with the shape of Tower General BuildingSingle

Town/City Wall
type: Class
subclass of: Structure
subclass of: Restriction
  on property: hasForm
  some values from: StructureFunction
comment: A spatial feature with the shape of Town/City Wall Structure

Triangulation Pillar
type: Class
subclass of: NonFunctionForm
subclass of: Structure
type: NamedIndividual
has function: Not Applicable
comment: A spatial feature with the shape Triangulation Pillar

Tunnel
type: Class
subclass of: Structure
subclass of: Restriction
  on property: hasForm
  some values from: StructureFunction
comment: A spatial feature with the shape of Tunnel Structure

Turbine
type: Class
subclass of: Structure
subclass of: Restriction
  on property: hasForm
  some values from: StructureFunction
comment: A spatial feature with the shape of Turbine Structure

Turntable
type: Class
subclass of: NonFunctionForm
subclass of: Structure
type: NamedIndividual
has function: Not Applicable
comment: A spatial feature with the shape Turntable

Utility Box
type: Class
subclass of: Structure
subclass of: Restriction
  on property: hasForm
  some values from: StructureFunction
comment: A spatial feature with the shape of Utility Box Structure

Utility Point
type: Class
subclass of: Structure
subclass of: Restriction
  on property: hasForm
  some values from: StructureFunction
comment: A spatial feature with the shape of Utility Point Structure

Wall
type: Class
subclass of: Division Line
subclass of: Restriction
  on property: hasForm
  some values from: DivisionLineFunction
comment: A spatial feature with the shape of Wall DivisionLine

Tower Water
type: Class
subclass of: NonFunctionForm
subclass of: Structure
type: NamedIndividual
has function: Not Applicable
comment: A spatial feature with the shape Tower Water

Water Works Complex
type: Class
subclass of: NonFunctionForm
subclass of: Site
type: NamedIndividual
has function: Not Applicable
comment: A spatial feature with the shape Water Works Complex

Waterfall
type: Class
subclass of: NonFunctionForm
subclass of: Structure
subclass of: Water
subclass of: Restriction
  on property: hasForm
  some values from: StructureFunction
type: NamedIndividual
has function: Not Applicable
comment: A spatial feature with the shape Waterfall
comment: A spatial feature with the shape of Waterfall Structure

Watermill
type: Class
subclass of: Building Single
subclass of: NonFunctionForm
type: NamedIndividual
has function: Not Applicable
comment: A spatial feature with the shape Watermill

Weir
type: Class
subclass of: NonFunctionForm
subclass of: Structure
subclass of: Water
subclass of: Restriction
  on property: hasForm
  some values from: StructureFunction
type: NamedIndividual
has function: Not Applicable
comment: A spatial feature with the shape Weir
comment: A spatial feature with the shape of Weir Structure

Well
type: Class
subclass of: Structure
subclass of: Restriction
  on property: hasForm
  some values from: StructureFunction
comment: A spatial feature with the shape of Well Structure

Wild Life Park
type: Class
subclass of: NonFunctionForm
subclass of: Site
type: NamedIndividual
has function: Not Applicable
comment: A spatial feature with the shape Wild Life Park

Wind Farm
type: Class
subclass of: NonFunctionForm
subclass of: Site
type: NamedIndividual
has function: Not Applicable
comment: A spatial feature with the shape Wind Farm

Windmill
type: Class
subclass of: Building Single
subclass of: NonFunctionForm
type: NamedIndividual
has function: Not Applicable
comment: A spatial feature with the shape Windmill

Woodland General
type: Class
subclass of: NonFunctionForm
subclass of: Vegetation
type: NamedIndividual
has function: Not Applicable
comment: A spatial feature with the shape Woodland General

Bog
type: Class
subclass of: NonFunctionForm
subclass of: Vegetation
type: NamedIndividual
has function: Not Applicable
comment: A spatial feature with the shape Bog

Zoo
type: Class
subclass of: NonFunctionForm
subclass of: Site
type: NamedIndividual
has function: Not Applicable
comment: A spatial feature with the shape Zoo

Bridge Fixed
type: Class
subclass of: Structure
subclass of: Restriction
  on property: hasForm
  some values from: StructureFunction
comment: A spatial feature with the shape of Bridge Fixed Structure

Bridge Foot
type: Class
subclass of: Structure
subclass of: Restriction
  on property: hasForm
  some values from: StructureFunction
comment: A spatial feature with the shape of Bridge Foot Structure

Bollard
type: Class
subclass of: NonFunctionForm
subclass of: Structure
type: NamedIndividual
has function: Not Applicable
comment: A spatial feature with the shape Bollard

Park
type: Class
subclass of: NonFunctionForm
subclass of: Site
type: NamedIndividual
has function: Not Applicable
comment: A spatial feature with the shape Park

Man-made Surface
type: Class
subclass of: Artificial Surface
subclass of: Structure
subclass of: Restriction
  on property: hasForm
  some values from: ArtificialSurfaceFunction
subclass of: Restriction
  on property: hasForm
  some values from: StructureFunction
comment: A spatial feature with the shape of Man-made Surface ArtificialSurface
comment: A spatial feature with the shape of Man-made Surface Structure

Segment Point
type: Class
subclass of: NonFunctionForm
subclass of: Rail Node
subclass of: Water
subclass of: Way
subclass of: Restriction
  on property: hasForm
  some values from: RailNodeFunction
subclass of: Restriction
  on property: hasForm
  some values from: WaterFunction
type: NamedIndividual
has function: Not Applicable
comment: A spatial feature with the shape Segment Point
comment: A spatial feature with the shape of Segment Point RailNode
comment: A spatial feature with the shape of Segment Point Water

Culvert Entry/Exit
type: Class
subclass of: NonFunctionForm
subclass of: Water
type: NamedIndividual
has function: Not Applicable
comment: A spatial feature with the shape Culvert Entry/Exit

Issue Point
type: Class
subclass of: NonFunctionForm
subclass of: Water
type: NamedIndividual
has function: Not Applicable
comment: A spatial feature with the shape Issue Point

Lake_Inflow
type: Class
subclass of: NonFunctionForm
subclass of: Water
type: NamedIndividual
has function: Not Applicable
comment: A spatial feature with the shape Lake_Inflow

Lake_Outflow
type: Class
subclass of: NonFunctionForm
subclass of: Water
type: NamedIndividual
has function: Not Applicable
comment: A spatial feature with the shape Lake_Outflow

Sink Point
type: Class
subclass of: NonFunctionForm
subclass of: Water
type: NamedIndividual
has function: Not Applicable
comment: A spatial feature with the shape Sink Point

Spring
type: Class
subclass of: NonFunctionForm
subclass of: Water
type: NamedIndividual
has function: Not Applicable
comment: A spatial feature with the shape Spring

Crossroads
type: Class
subclass of: NonFunctionForm
subclass of: Way
type: NamedIndividual
has function: Not Applicable
comment: A spatial feature with the shape Crossroads

End of Road
type: Class
subclass of: NonFunctionForm
subclass of: Way
type: NamedIndividual
has function: Not Applicable
comment: A spatial feature with the shape End of Road

End of Runway
type: Class
subclass of: NonFunctionForm
subclass of: Way
type: NamedIndividual
has function: Not Applicable
comment: A spatial feature with the shape End of Runway

Roundabout Mini
type: Class
subclass of: NonFunctionForm
subclass of: Way
type: NamedIndividual
has function: Not Applicable
comment: A spatial feature with the shape Roundabout Mini

Single Carriageway to Dual Carriageway
type: Class
subclass of: NonFunctionForm
subclass of: Way
type: NamedIndividual
has function: Not Applicable
comment: A spatial feature with the shape Single Carriageway to Dual Carriageway

Boundary Stone
type: Class
subclass of: NonFunctionForm
subclass of: Structure
type: NamedIndividual
has function: Not Applicable
comment: A spatial feature with the shape Boundary Stone

T Junction
type: Class
subclass of: NonFunctionForm
subclass of: Way
type: NamedIndividual
has function: Not Applicable
comment: A spatial feature with the shape T Junction

Taxiway Apron
type: Class
subclass of: NonFunctionForm
subclass of: Way
type: NamedIndividual
has function: Not Applicable
comment: A spatial feature with the shape Taxiway Apron

Taxiway Runway
type: Class
subclass of: NonFunctionForm
subclass of: Way
type: NamedIndividual
has function: Not Applicable
comment: A spatial feature with the shape Taxiway Runway

End of Sliproad
type: Class
subclass of: NonFunctionForm
subclass of: Way
type: NamedIndividual
has function: Not Applicable
comment: A spatial feature with the shape End of Sliproad

Y Junction
type: Class
subclass of: NonFunctionForm
subclass of: Way
type: NamedIndividual
has function: Not Applicable
comment: A spatial feature with the shape Y Junction

Golf Links
type: Class
subclass of: Site
subclass of: Restriction
  on property: hasForm
  some values from: SiteFunction
comment: A spatial feature with the shape of Golf Links Site

Pitch and Putt
type: Class
subclass of: Site
subclass of: Restriction
  on property: hasForm
  some values from: SiteFunction
comment: A spatial feature with the shape of Pitch and Putt Site

Cave
type: Class
subclass of: NonFunctionForm
subclass of: Structure
type: NamedIndividual
has function: Not Applicable
comment: A spatial feature with the shape Cave

Secure Area
type: Class
subclass of: Artificial Surface
subclass of: NonFunctionForm
type: NamedIndividual
has function: Not Applicable
comment: A spatial feature with the shape Secure Area

Sliproad Junction
type: Class
subclass of: NonFunctionForm
subclass of: Way
type: NamedIndividual
has function: Not Applicable
comment: A spatial feature with the shape Sliproad Junction

Bowling Green
type: Class
subclass of: NonFunctionForm
subclass of: Site
type: NamedIndividual
has function: Not Applicable
comment: A spatial feature with the shape Bowling Green

Multi Junction
type: Class
subclass of: NonFunctionForm
subclass of: Way
type: NamedIndividual
has function: Not Applicable
comment: A spatial feature with the shape Multi Junction

Link Road
type: Class
subclass of: Way
subclass of: Restriction
  on property: hasForm
  some values from: WayFunction
comment: A spatial feature with the shape of Link Road Way

Northern Ireland
type: Class
subclass of: Artificial Surface
subclass of: NonFunctionForm
type: NamedIndividual
has function: Not Applicable
comment: A spatial feature with the shape Northern Ireland

Mobile Home/Caravan
type: Class
subclass of: Structure
subclass of: Restriction
  on property: hasForm
  some values from: StructureFunction
comment: A spatial feature with the shape of Mobile Home/Caravan Structure

Breakwater
type: Class
subclass of: NonFunctionForm
subclass of: Structure
type: NamedIndividual
has function: Not Applicable
comment: A spatial feature with the shape Breakwater

Weighbridge
type: Class
subclass of: NonFunctionForm
subclass of: Structure
type: NamedIndividual
has function: Not Applicable
comment: A spatial feature with the shape Weighbridge

Market
type: Class
subclass of: Building Single
subclass of: Restriction
  on property: hasForm
  some values from: BuildingSingleFunction
comment: A spatial feature with the shape of Market BuildingSingle

Virtual Junction
type: Class
subclass of: Division Line
subclass of: NonFunctionForm
type: NamedIndividual
has function: Not Applicable
comment: A spatial feature with the shape Virtual Junction

Gate Lodge
type: Class
subclass of: Building Single
subclass of: Restriction
  on property: hasForm
  some values from: BuildingSingleFunction
comment: A spatial feature with the shape of Gate Lodge BuildingSingle

Turning Circle
type: Class
subclass of: NonFunctionForm
subclass of: Way
subclass of: Restriction
  on property: hasForm
  some values from: WayFunction
type: NamedIndividual
has function: Not Applicable
comment: A spatial feature with the shape Turning Circle
comment: A spatial feature with the shape of Turning Circle Way

Gabion Wall
type: Class
subclass of: Division Line
subclass of: Restriction
  on property: hasForm
  some values from: DivisionLineFunction
comment: A spatial feature with the shape of Gabion Wall DivisionLine

Gate
type: Class
subclass of: Division Line
subclass of: Restriction
  on property: hasForm
  some values from: DivisionLineFunction
comment: A spatial feature with the shape of Gate DivisionLine
comment: A spatial feature with the shape of null DivisionLine
label: null

Duplex
type: Class
subclass of: Building Single
subclass of: Restriction
  on property: hasForm
  some values from: BuildingSingleFunction
comment: A spatial feature with the shape of Duplex BuildingSingle

Broadcasting Station
type: Class
subclass of: NonFunctionForm
subclass of: Site
type: NamedIndividual
has function: Not Applicable
comment: A spatial feature with the shape Broadcasting Station

Building Group General
type: Class
subclass of: Building Group
subclass of: NonFunctionForm
type: NamedIndividual
has function: Not Applicable
comment: A spatial feature with the shape Building Group General

Building General
type: Class
subclass of: Building Single
subclass of: Restriction
  on property: hasForm
  some values from: BuildingSingleFunction
comment: A spatial feature with the shape of Building General BuildingSingle

Bus Depot
type: Class
subclass of: NonFunctionForm
subclass of: Site
type: NamedIndividual
has function: Not Applicable
comment: A spatial feature with the shape Bus Depot

Air Transmitter Beacon
type: Class
subclass of: Structure
subclass of: Restriction
  on property: hasForm
  some values from: StructureFunction
comment: A spatial feature with the shape of Air Transmitter Beacon Structure

Bus Shelter
type: Class
subclass of: NonFunctionForm
subclass of: Structure
type: NamedIndividual
has function: Not Applicable
comment: A spatial feature with the shape Bus Shelter

Business Park
type: Class
subclass of: NonFunctionForm
subclass of: Site
type: NamedIndividual
has function: Not Applicable
comment: A spatial feature with the shape Business Park

Butt
type: Class
subclass of: NonFunctionForm
subclass of: Structure
type: NamedIndividual
has function: Not Applicable
comment: A spatial feature with the shape Butt

null
type: Class
subclass of: NonFunctionForm
subclass of: Site
type: NamedIndividual
has function: Not Applicable
comment: A spatial feature with the shape null

Camping Park
type: Class
subclass of: NonFunctionForm
subclass of: Site
type: NamedIndividual
has function: Not Applicable
comment: A spatial feature with the shape Camping Park

Canal
type: Class
subclass of: NonFunctionForm
subclass of: Water
type: NamedIndividual
has function: Not Applicable
comment: A spatial feature with the shape Canal

Canal Harbour
type: Class
subclass of: NonFunctionForm
subclass of: Water
type: NamedIndividual
has function: Not Applicable
comment: A spatial feature with the shape Canal Harbour

Canal Lock
type: Class
subclass of: NonFunctionForm
subclass of: Water
type: NamedIndividual
has function: Not Applicable
comment: A spatial feature with the shape Canal Lock

Airfield
type: Class
subclass of: NonFunctionForm
subclass of: Site
type: NamedIndividual
has function: Not Applicable
comment: A spatial feature with the shape Airfield

Canopy
type: Class
subclass of: NonFunctionForm
subclass of: Structure
subclass of: Restriction
  on property: hasForm
  some values from: StructureFunction
type: NamedIndividual
has function: Not Applicable
comment: A spatial feature with the shape Canopy
comment: A spatial feature with the shape of Canopy Structure

Capstan
type: Class
subclass of: NonFunctionForm
subclass of: Structure
type: NamedIndividual
has function: Not Applicable
comment: A spatial feature with the shape Capstan

Caravan and Camping Park
type: Class
subclass of: NonFunctionForm
subclass of: Site
type: NamedIndividual
has function: Not Applicable
comment: A spatial feature with the shape Caravan and Camping Park

Caravan Park
type: Class
subclass of: NonFunctionForm
subclass of: Site
type: NamedIndividual
has function: Not Applicable
comment: A spatial feature with the shape Caravan Park

Castle
type: Class
subclass of: Building Single
subclass of: NonFunctionForm
subclass of: Site
type: NamedIndividual
has function: Not Applicable
comment: A spatial feature with the shape Castle

Cement Works
type: Class
subclass of: NonFunctionForm
subclass of: Site
type: NamedIndividual
has function: Not Applicable
comment: A spatial feature with the shape Cement Works

Cemetery
type: Class
subclass of: NonFunctionForm
subclass of: Site
subclass of: Restriction
  on property: hasForm
  some values from: SiteFunction
type: NamedIndividual
has function: Not Applicable
comment: A spatial feature with the shape Cemetery
comment: A spatial feature with the shape of Cemetery Site

Airport
type: Class
subclass of: Site
subclass of: Restriction
  on property: hasForm
  some values from: SiteFunction
comment: A spatial feature with the shape of Airport Site

Chapel
type: Class
subclass of: Building Single
subclass of: NonFunctionForm
type: NamedIndividual
has function: Not Applicable
comment: A spatial feature with the shape Chapel

Chimney
type: Class
subclass of: NonFunctionForm
subclass of: Structure
type: NamedIndividual
has function: Not Applicable
comment: A spatial feature with the shape Chimney

Church
type: Class
subclass of: Building Single
subclass of: Site
subclass of: Restriction
  on property: hasForm
  some values from: BuildingSingleFunction
subclass of: Restriction
  on property: hasForm
  some values from: SiteFunction
comment: A spatial feature with the shape of Church BuildingSingle
comment: A spatial feature with the shape of Church Site

Cist
type: Class
subclass of: Structure
subclass of: Restriction
  on property: hasForm
  some values from: StructureFunction
comment: A spatial feature with the shape of Cist Structure

Airport Terminal
type: Class
subclass of: Building Single
subclass of: NonFunctionForm
type: NamedIndividual
has function: Not Applicable
comment: A spatial feature with the shape Airport Terminal

Clubhouse
type: Class
subclass of: Building Single
subclass of: NonFunctionForm
type: NamedIndividual
has function: Not Applicable
comment: A spatial feature with the shape Clubhouse

College
type: Class
subclass of: Building Single
subclass of: Site
subclass of: Restriction
  on property: hasForm
  some values from: BuildingSingleFunction
subclass of: Restriction
  on property: hasForm
  some values from: SiteFunction
comment: A spatial feature with the shape of College BuildingSingle
comment: A spatial feature with the shape of College Site

Woodland Coniferous
type: Class
subclass of: Vegetation
subclass of: Restriction
  on property: hasForm
  some values from: VegetationFunction
comment: A spatial feature with the shape of Woodland Coniferous Vegetation

Tower Control
type: Class
subclass of: Building Single
subclass of: NonFunctionForm
type: NamedIndividual
has function: Not Applicable
comment: A spatial feature with the shape Tower Control

Convent
type: Class
subclass of: NonFunctionForm
subclass of: Site
type: NamedIndividual
has function: Not Applicable
comment: A spatial feature with the shape Convent

Conveyor
type: Class
subclass of: Structure
subclass of: Restriction
  on property: hasForm
  some values from: StructureFunction
comment: A spatial feature with the shape of Conveyor Structure

Function
type: Class
comment: Describes what an object does, or is used for. OSi Spatial Objects have a mandatory Function value, but this value may be null for some features in accordance with the Specification for the particular feature. The Function value must be valid when combined with the Form value for an object.

NonFunctionForm
type: Class
subclass of: Form
subclass of: Restriction
  on property: has function
  max cardinality: 0
comment: A non-functional form is one which cannot have any function assigned, for example a historical site or ruins that has no current function.

Rail Node
type: Class
subclass of: Way
subclass of: Restriction
  on property: has function
  some values from: RailNodeFunction
comment: Rail Nodes are used to segment the railway network. Rail Nodes, have Form & Function values such as switch points, end of way, turntable, etc.

Service Line
type: Class
subclass of: Form
subclass of: Restriction
  on property: has function
  some values from: ServiceLineFunction
comment: A Service Line is a conduit conveying a utility - such as electricity, gas, oil, water or sewage - from a main distribution area or to a main collection area. The definition is specific to the actual pipeline or powerline itself, and does not include supporting objects such as pole, pylons or ancillary buildings. A Service Line must start and end at a Pole or Pylon. Lines may cross each other but are continuous from the start to end point.

Site
type: Class
subclass of: Form
subclass of: Restriction
  on property: has function
  some values from: SiteFunction
comment: A Site is an area encompassing complete, contiguous, Skin-of-the-Earth objects that share a common characteristic in the real world. Examples are: a Hospital Complex, a Business Park, or a Sports Ground. A Site may include a Way or Water object, if the object is fully contained within the extent of the Site.

Structure
type: Class
subclass of: Form
subclass of: Restriction
  on property: has function
  some values from: StructureFunction
comment: Structure objects represent a wide variety of real world objects, including buildings, bridges & tunnels, poles & pylons, tanks & piers, monuments & standing stones.

Vegetation
type: Class
subclass of: Form
subclass of: Restriction
  on property: has function
  some values from: VegetationFunction
comment: A Vegetation object is an area of ground surface that naturally supports, or can support, living plants. Vegetation includes pastures and woodlands, as well as heath, bog and marsh. Vegetation is the default object for road and rail verges, the central area of roundabouts and traffic islands and medians. Note that a surface of natural clay, although not vegetation, is potentially supportive of vegetation and so is included without separate distinction, in the Vegetation Form "Grass/Clay Surface". A "clay" tennis court is not clay in terms of the Vegetation definition - it is classified as an Artificial surface. Whereas a private garden usually supports plant life, in Geoff it is regarded as an Artificial Surface.

Water
type: Class
subclass of: Form
subclass of: Restriction
  on property: has function
  some values from: WaterFunction
comment: A Water form is a recognised body of surface water occurring anywhere within a state and includes both inland and sea areas. "Recognised" here means that the water body has historically been included as a feature or is a new water body that is considered permanent and substantial. Water forms also include intersection points.

Way
type: Class
subclass of: Form
subclass of: Restriction
  on property: has function
  some values from: WayFunction
comment: Way forms represent all drivable and walkable roads and paths, as well as intersection points.

Not Applicable
type: NamedIndividual
type: Function
comment: The function Not Applicable

Clock Tower
type: NamedIndividual
type: BuildingSingleFunction
has typical form: Tower General
comment: The function Clock Tower

Closed Well
type: NamedIndividual
type: StructureFunction
has typical form: Well
comment: The function Closed Well

Coastguard Station
type: NamedIndividual
type: BuildingSingleFunction
has typical form: Building General
comment: The function Coastguard Station

Cold Store
type: NamedIndividual
type: BuildingSingleFunction
has typical form: Building General
comment: The function Cold Store

Community Centre
type: NamedIndividual
type: BuildingSingleFunction
has typical form: Building General
comment: The function Community Centre

Concert Hall
type: NamedIndividual
type: BuildingSingleFunction
has typical form: Building General
comment: The function Concert Hall

400Kv
type: NamedIndividual
type: ServiceLineFunction
has typical form: Powerline Overhead Electricity
comment: The function 400Kv

Conference Centre
type: NamedIndividual
type: BuildingSingleFunction
has typical form: Building General
comment: The function Conference Centre

Consulate
type: NamedIndividual
type: BuildingSingleFunction
has typical form: Building General
comment: The function Consulate

Convent
type: NamedIndividual
type: BuildingSingleFunction
type: StructureFunction
has typical form: Ruin
has typical form: Building General
comment: The function Convent

Courthouse
type: NamedIndividual
type: BuildingSingleFunction
has typical form: Building General
comment: The function Courthouse

Creamery
type: NamedIndividual
type: BuildingSingleFunction
has typical form: Building General
comment: The function Creamery

Credit Union
type: NamedIndividual
type: BuildingSingleFunction
has typical form: Building General
comment: The function Credit Union

Crematorium
type: NamedIndividual
type: BuildingSingleFunction
has typical form: Building General
comment: The function Crematorium

Cricket Ground
type: NamedIndividual
type: SiteFunction
has typical form: Sports Ground
comment: The function Cricket Ground

Field Cropland
type: NamedIndividual
type: VegetationFunction
has typical form: Grass/Clay Surface
comment: The function Field Cropland

Golf Links 9 Hole
type: NamedIndividual
type: SiteFunction
has typical form: Golf Links
comment: The function Golf Links 9 Hole

Day Centre
type: NamedIndividual
type: BuildingSingleFunction
has typical form: Building General
comment: The function Day Centre

Dental Hospital
type: NamedIndividual
type: BuildingSingleFunction
has typical form: Hospital
comment: The function Dental Hospital

Distillery
type: NamedIndividual
type: BuildingSingleFunction
has typical form: Building General
comment: The function Distillery

Divider
type: NamedIndividual
type: DivisionLineFunction
has typical form: Fence
has typical form: Hedge
has typical form: Bank
has typical form: Railing
has typical form: Wall
comment: The function Divider

Abattoir
type: NamedIndividual
type: BuildingSingleFunction
has typical form: Building General
comment: The function Abattoir

Yard Dock
type: NamedIndividual
type: ArtificialSurfaceFunction
has typical form: Man-made Surface
comment: The function Yard Dock

Domestic Airport
type: NamedIndividual
type: SiteFunction
has typical form: Airport
comment: The function Domestic Airport

Domestic Vehicular
type: NamedIndividual
type: WayFunction
has typical form: Ferry Line
comment: The function Domestic Vehicular

Abbey
type: NamedIndividual
type: BuildingSingleFunction
type: SiteFunction
type: StructureFunction
has typical form: Antiquity
has typical form: Ruin
has typical form: Building General
comment: The function Abbey

Electricity Distribution
type: NamedIndividual
type: StructureFunction
has typical form: Utility Box
comment: The function Electricity Distribution

Electricity Generation
type: NamedIndividual
type: StructureFunction
has typical form: Dam
comment: The function Electricity Generation

Electricity Pole
type: NamedIndividual
type: StructureFunction
has typical form: Pole
comment: The function Electricity Pole

Electricity Station
type: NamedIndividual
type: BuildingSingleFunction
has typical form: Building General
comment: The function Electricity Station

Elevated Conveyor Belt
type: NamedIndividual
type: StructureFunction
has typical form: Conveyor
comment: The function Elevated Conveyor Belt

Embankment
type: NamedIndividual
type: StructureFunction
has typical form: Landform
comment: The function Embankment

Embassy
type: NamedIndividual
type: BuildingSingleFunction
type: SiteFunction
has typical form: Government Complex
has typical form: Building General
comment: The function Embassy

Adventure Centre
type: NamedIndividual
type: BuildingSingleFunction
has typical form: Building General
comment: The function Adventure Centre

Emergency Phone
type: NamedIndividual
type: StructureFunction
has typical form: Telephone Point
comment: The function Emergency Phone

Enclosed Traffic Area
type: NamedIndividual
type: ArtificialSurfaceFunction
has typical form: Man-made Surface
comment: The function Enclosed Traffic Area

Agricultural College
type: NamedIndividual
type: SiteFunction
has typical form: College
comment: The function Agricultural College

Equestrian Centre
type: NamedIndividual
type: BuildingSingleFunction
has typical form: Building General
comment: The function Equestrian Centre

Eye and Ear Hospital
type: NamedIndividual
type: BuildingSingleFunction
type: SiteFunction
has typical form: Hospital
has typical form: Hospital Complex
comment: The function Eye and Ear Hospital

Factory
type: NamedIndividual
type: BuildingSingleFunction
has typical form: Building General
comment: The function Factory

Yard Farm
type: NamedIndividual
type: ArtificialSurfaceFunction
has typical form: Man-made Surface
comment: The function Yard Farm

Fifth Class
type: NamedIndividual
type: WayFunction
has typical form: Level Crossing
has typical form: Roundabout
has typical form: Single Carriageway
has typical form: Link Road
comment: The function Fifth Class

Firebreak
type: NamedIndividual
type: VegetationFunction
has typical form: Scrub
comment: The function Firebreak

First Class
type: NamedIndividual
type: WayFunction
has typical form: Dual Carriageway
has typical form: Roundabout
has typical form: Single Carriageway
has typical form: Sliproad
comment: The function First Class

Air Corps Barracks
type: NamedIndividual
type: BuildingSingleFunction
has typical form: Barrack
comment: The function Air Corps Barracks

Fitness Centre
type: NamedIndividual
type: BuildingSingleFunction
has typical form: Building General
comment: The function Fitness Centre

Flag Pole
type: NamedIndividual
type: StructureFunction
has typical form: Pole
comment: The function Flag Pole

Flood Gate
type: NamedIndividual
type: StructureFunction
has typical form: Sluice Gate
comment: The function Flood Gate

Flow Control
type: NamedIndividual
type: StructureFunction
has typical form: Dam
comment: The function Flow Control

Folly
type: NamedIndividual
type: StructureFunction
has typical form: Monument
comment: The function Folly

Fort
type: NamedIndividual
type: StructureFunction
has typical form: Ruin
comment: The function Fort

Airport Building
type: NamedIndividual
type: BuildingSingleFunction
has typical form: Building General
comment: The function Airport Building

Fourth Class
type: NamedIndividual
type: WayFunction
has typical form: Dual Carriageway
has typical form: Entrance or Exit Car Park
has typical form: Level Crossing
has typical form: Roundabout
has typical form: Single Carriageway
has typical form: Sliproad
has typical form: Link Road
has typical form: Turning Circle
comment: The function Fourth Class

Friary
type: NamedIndividual
type: BuildingSingleFunction
type: StructureFunction
has typical form: Ruin
has typical form: Building General
comment: The function Friary

Funeral Home
type: NamedIndividual
type: BuildingSingleFunction
has typical form: Building General
comment: The function Funeral Home

GAA Ground
type: NamedIndividual
type: SiteFunction
has typical form: Sports Ground
comment: The function GAA Ground

Garage
type: NamedIndividual
type: BuildingSingleFunction
has typical form: Building General
comment: The function Garage

Garda Headquarter
type: NamedIndividual
type: BuildingSingleFunction
has typical form: Barrack
comment: The function Garda Headquarter

Garda Training College
type: NamedIndividual
type: BuildingSingleFunction
has typical form: Barrack
comment: The function Garda Training College

10Kv
type: NamedIndividual
type: ServiceLineFunction
has typical form: Powerline Overhead Electricity
comment: The function 10Kv

Field Allotment
type: NamedIndividual
type: VegetationFunction
has typical form: Grass/Clay Surface
comment: The function Field Allotment

Gas Station
type: NamedIndividual
type: BuildingSingleFunction
has typical form: Building General
comment: The function Gas Station

Gas Tank
type: NamedIndividual
type: StructureFunction
has typical form: Tank
comment: The function Gas Tank

Gate
type: NamedIndividual
type: StructureFunction
has typical form: Ruin
comment: The function Gate

General Hospital
type: NamedIndividual
type: BuildingSingleFunction
type: SiteFunction
has typical form: Hospital
has typical form: Hospital Complex
comment: The function General Hospital

Yard General
type: NamedIndividual
type: ArtificialSurfaceFunction
has typical form: Man-made Surface
comment: The function Yard General

Yard Goods
type: NamedIndividual
type: ArtificialSurfaceFunction
has typical form: Man-made Surface
comment: The function Yard Goods

Gravel Pit
type: NamedIndividual
type: ExposedSurfaceFunction
has typical form: Pit
comment: The function Gravel Pit

Gravel Quarry
type: NamedIndividual
type: ExposedSurfaceFunction
has typical form: Quarry
comment: The function Gravel Quarry

Graveyard
type: NamedIndividual
type: VegetationFunction
has typical form: Grass/Clay Surface
comment: The function Graveyard

Grotto
type: NamedIndividual
type: StructureFunction
has typical form: Monument
comment: The function Grotto

Hall
type: NamedIndividual
type: BuildingSingleFunction
has typical form: Building General
comment: The function Hall

Hangar
type: NamedIndividual
type: BuildingSingleFunction
has typical form: Building General
comment: The function Hangar

Ambulance Station
type: NamedIndividual
type: BuildingSingleFunction
has typical form: Building General
comment: The function Ambulance Station

Health Centre
type: NamedIndividual
type: BuildingSingleFunction
has typical form: Building General
comment: The function Health Centre

Hearing Impaired School
type: NamedIndividual
type: BuildingSingleFunction
type: SiteFunction
has typical form: School
comment: The function Hearing Impaired School

Hill Fort
type: NamedIndividual
type: SiteFunction
has typical form: Antiquity
comment: The function Hill Fort

Amusement Arcade
type: NamedIndividual
type: BuildingSingleFunction
has typical form: Building General
comment: The function Amusement Arcade

Hospice
type: NamedIndividual
type: BuildingSingleFunction
type: SiteFunction
has typical form: Hospital
has typical form: Hospital Complex
comment: The function Hospice

Hostel
type: NamedIndividual
type: BuildingSingleFunction
has typical form: Building General
comment: The function Hostel

House Ruin
type: NamedIndividual
type: StructureFunction
has typical form: Ruin
comment: The function House Ruin

Hut
type: NamedIndividual
type: BuildingSingleFunction
has typical form: Building General
comment: The function Hut

Hydrant
type: NamedIndividual
type: StructureFunction
has typical form: Utility Point
comment: The function Hydrant

Icehouse
type: NamedIndividual
type: BuildingSingleFunction
has typical form: Building General
comment: The function Icehouse

Yard Industrial
type: NamedIndividual
type: ArtificialSurfaceFunction
has typical form: Man-made Surface
comment: The function Yard Industrial

Institute of Technology
type: NamedIndividual
type: BuildingSingleFunction
type: SiteFunction
has typical form: College
comment: The function Institute of Technology

International Airport
type: NamedIndividual
type: SiteFunction
has typical form: Airport
comment: The function International Airport

Interpretive Centre
type: NamedIndividual
type: BuildingSingleFunction
has typical form: Building General
comment: The function Interpretive Centre

Jehovah Witness Church
type: NamedIndividual
type: BuildingSingleFunction
type: SiteFunction
has typical form: Church
comment: The function Jehovah Witness Church

Anglican Church
type: NamedIndividual
type: BuildingSingleFunction
type: SiteFunction
has typical form: Church
comment: The function Anglican Church

Juvenile Detention Centre
type: NamedIndividual
type: BuildingSingleFunction
type: SiteFunction
has typical form: Prison
has typical form: Prison Complex
comment: The function Juvenile Detention Centre

Kiln
type: NamedIndividual
type: StructureFunction
has typical form: Ruin
comment: The function Kiln

Laboratory
type: NamedIndividual
type: BuildingSingleFunction
has typical form: Building General
comment: The function Laboratory

Lamp Standard
type: NamedIndividual
type: StructureFunction
has typical form: Pole
comment: The function Lamp Standard

Language School
type: NamedIndividual
type: BuildingSingleFunction
has typical form: School
comment: The function Language School

Latter Day Saints Church
type: NamedIndividual
type: BuildingSingleFunction
type: SiteFunction
has typical form: Church
comment: The function Latter Day Saints Church

Animal Pound
type: NamedIndividual
type: BuildingSingleFunction
has typical form: Building General
comment: The function Animal Pound

Laundry
type: NamedIndividual
type: BuildingSingleFunction
has typical form: Building General
comment: The function Laundry

Letter Box
type: NamedIndividual
type: StructureFunction
has typical form: Utility Point
comment: The function Letter Box

Library
type: NamedIndividual
type: BuildingSingleFunction
has typical form: Building General
comment: The function Library

Limestone Quarry
type: NamedIndividual
type: ExposedSurfaceFunction
has typical form: Quarry
comment: The function Limestone Quarry

Local Government Building
type: NamedIndividual
type: BuildingSingleFunction
type: SiteFunction
has typical form: Government Complex
has typical form: Building General
comment: The function Local Government Building

Main Road
type: NamedIndividual
type: WayFunction
has typical form: Dual Carriageway
has typical form: Level Crossing
has typical form: Motorway
has typical form: Roundabout
has typical form: Service Road
has typical form: Single Carriageway
has typical form: Sliproad
has typical form: Toll Plaza
has typical form: Link Road
comment: The function Main Road

Male Detention Centre
type: NamedIndividual
type: BuildingSingleFunction
type: SiteFunction
has typical form: Prison
has typical form: Prison Complex
comment: The function Male Detention Centre

Managed Woodland
type: NamedIndividual
type: VegetationFunction
has typical form: Woodland Deciduous
has typical form: Woodland Mixed
has typical form: Woodland Coniferous
comment: The function Managed Woodland

Antiquity
type: NamedIndividual
type: BuildingSingleFunction
type: StructureFunction
has typical form: Crannog
has typical form: Cromlech
has typical form: Dolmen
has typical form: Tower Martello
has typical form: Megalithic Tomb
has typical form: Souterrain
has typical form: Standing Stone
has typical form: Stone Circle
has typical form: Town/City Wall
has typical form: Cist
comment: The function Antiquity

Manhole
type: NamedIndividual
type: StructureFunction
has typical form: Utility Point
comment: The function Manhole

Maternity Hospital
type: NamedIndividual
type: BuildingSingleFunction
type: SiteFunction
has typical form: Hospital
has typical form: Hospital Complex
comment: The function Maternity Hospital

Mausoleum
type: NamedIndividual
type: BuildingSingleFunction
has typical form: Building General
comment: The function Mausoleum

Median
type: NamedIndividual
type: ArtificialSurfaceFunction
type: DivisionLineFunction
type: VegetationFunction
has typical form: Fence
has typical form: Grass/Clay Surface
has typical form: Railing
has typical form: Wall
has typical form: Man-made Surface
comment: The function Median

Memorial
type: NamedIndividual
type: StructureFunction
has typical form: Monument
comment: The function Memorial

Methodist Church
type: NamedIndividual
type: BuildingSingleFunction
type: SiteFunction
has typical form: Church
comment: The function Methodist Church

Military Airport
type: NamedIndividual
type: SiteFunction
has typical form: Airport
comment: The function Military Airport

Military Shooting Range
type: NamedIndividual
type: SiteFunction
has typical form: Shooting Range
comment: The function Military Shooting Range

Mill
type: NamedIndividual
type: StructureFunction
has typical form: Ruin
comment: The function Mill

Monastery
type: NamedIndividual
type: StructureFunction
has typical form: Ruin
comment: The function Monastery

Montessori School
type: NamedIndividual
type: BuildingSingleFunction
type: SiteFunction
has typical form: School
comment: The function Montessori School

Mortuary
type: NamedIndividual
type: BuildingSingleFunction
has typical form: Building General
comment: The function Mortuary

Multiple Use
type: NamedIndividual
type: ArtificialSurfaceFunction
type: BuildingSingleFunction
type: SiteFunction
type: StructureFunction
has typical form: Bridge Draw
has typical form: Leisure Complex
has typical form: Sports Ground
has typical form: Sports Stadium
has typical form: Bridge Fixed
has typical form: Man-made Surface
has typical form: Building General
comment: The function Multiple Use

110Kv
type: NamedIndividual
type: ServiceLineFunction
has typical form: Powerline Overhead Electricity
comment: The function 110Kv

Antiquity General
type: NamedIndividual
type: SiteFunction
has typical form: Antiquity
comment: The function Antiquity General

Museum
type: NamedIndividual
type: BuildingSingleFunction
has typical form: Building General
comment: The function Museum

Natural Bedrock
type: NamedIndividual
type: ExposedSurfaceFunction
has typical form: Rock Face
comment: The function Natural Bedrock

Navy Barracks
type: NamedIndividual
type: BuildingSingleFunction
has typical form: Barrack
comment: The function Navy Barracks

Non-Directional beacon
type: NamedIndividual
type: StructureFunction
has typical form: Air Transmitter Beacon
comment: The function Non-Directional beacon

Non-Navigable River
type: NamedIndividual
type: WaterFunction
has typical form: River
comment: The function Non-Navigable River

Nunnery
type: NamedIndividual
type: StructureFunction
has typical form: Ruin
comment: The function Nunnery

Nursing Home
type: NamedIndividual
type: BuildingSingleFunction
has typical form: Building General
comment: The function Nursing Home

Obelisk
type: NamedIndividual
type: StructureFunction
has typical form: Monument
comment: The function Obelisk

Oil Depot
type: NamedIndividual
type: BuildingSingleFunction
has typical form: Building General
comment: The function Oil Depot

Oil Tank
type: NamedIndividual
type: StructureFunction
has typical form: Tank
comment: The function Oil Tank

Grassland Pasture
type: NamedIndividual
type: VegetationFunction
has typical form: Grass/Clay Surface
comment: The function Grassland Pasture

Reservoir Open
type: NamedIndividual
type: ArtificialSurfaceFunction
has typical form: Man-made Surface
comment: The function Reservoir Open

Open Well
type: NamedIndividual
type: StructureFunction
has typical form: Well
comment: The function Open Well

Oratory
type: NamedIndividual
type: BuildingSingleFunction
has typical form: Building General
comment: The function Oratory

Ornamental
type: NamedIndividual
type: DivisionLineFunction
has typical form: Hedge
has typical form: Wall
comment: The function Ornamental

Yard Ornamental
type: NamedIndividual
type: ArtificialSurfaceFunction
has typical form: Man-made Surface
comment: The function Yard Ornamental

Outbuilding
type: NamedIndividual
type: BuildingSingleFunction
has typical form: Building General
comment: The function Outbuilding

Outdoor Swimming Pool
type: NamedIndividual
type: StructureFunction
has typical form: Baths
comment: The function Outdoor Swimming Pool

Golf Course Par 3
type: NamedIndividual
type: SiteFunction
has typical form: Golf Course
comment: The function Golf Course Par 3

Aquarium
type: NamedIndividual
type: BuildingSingleFunction
has typical form: Building General
comment: The function Aquarium

Parochial House
type: NamedIndividual
type: BuildingSingleFunction
has typical form: Building General
comment: The function Parochial House

Field Pasture
type: NamedIndividual
type: VegetationFunction
has typical form: Grass/Clay Surface
comment: The function Field Pasture

Pavilion
type: NamedIndividual
type: BuildingSingleFunction
has typical form: Building General
comment: The function Pavilion

Pedestrian Bridge
type: NamedIndividual
type: StructureFunction
has typical form: Bridge Fixed
has typical form: Bridge Foot
comment: The function Pedestrian Bridge

Phone Kiosk
type: NamedIndividual
type: StructureFunction
has typical form: Telephone Point
comment: The function Phone Kiosk

Piggery
type: NamedIndividual
type: BuildingSingleFunction
has typical form: Building General
comment: The function Piggery

Polo Ground
type: NamedIndividual
type: VegetationFunction
has typical form: Grass/Clay Surface
comment: The function Polo Ground

Post Office
type: NamedIndividual
type: BuildingSingleFunction
has typical form: Building General
comment: The function Post Office

Pottery
type: NamedIndividual
type: BuildingSingleFunction
has typical form: Building General
comment: The function Pottery

Power Station
type: NamedIndividual
type: BuildingSingleFunction
has typical form: Building General
comment: The function Power Station

Prayer/Mission Hall
type: NamedIndividual
type: BuildingSingleFunction
has typical form: Building General
comment: The function Prayer/Mission Hall

Presbyterian Church
type: NamedIndividual
type: BuildingSingleFunction
type: SiteFunction
has typical form: Church
comment: The function Presbyterian Church

Presbytery
type: NamedIndividual
type: BuildingSingleFunction
has typical form: Building General
comment: The function Presbytery

Primary School
type: NamedIndividual
type: BuildingSingleFunction
type: SiteFunction
has typical form: School
comment: The function Primary School

Priory
type: NamedIndividual
type: BuildingSingleFunction
type: StructureFunction
has typical form: Ruin
has typical form: Building General
comment: The function Priory

Private College
type: NamedIndividual
type: BuildingSingleFunction
type: SiteFunction
has typical form: College
comment: The function Private College

Psychiatric Hospital
type: NamedIndividual
type: BuildingSingleFunction
type: SiteFunction
has typical form: Hospital
has typical form: Hospital Complex
comment: The function Psychiatric Hospital

Public Garden
type: NamedIndividual
type: SiteFunction
has typical form: Park Enclosed
comment: The function Public Garden

Public House
type: NamedIndividual
type: BuildingSingleFunction
has typical form: Building General
comment: The function Public House

Pump House
type: NamedIndividual
type: BuildingSingleFunction
has typical form: Building General
comment: The function Pump House

Quarried Bedrock
type: NamedIndividual
type: ExposedSurfaceFunction
has typical form: Rock Face
comment: The function Quarried Bedrock

Radio Station
type: NamedIndividual
type: BuildingSingleFunction
has typical form: Building General
comment: The function Radio Station

Rail Edge
type: NamedIndividual
type: ArtificialSurfaceFunction
has typical form: Man-made Surface
comment: The function Rail Edge

Rail Tunnel
type: NamedIndividual
type: StructureFunction
has typical form: Tunnel
comment: The function Rail Tunnel

Railway Terminus
type: NamedIndividual
type: BuildingSingleFunction
has typical form: Railway Station
comment: The function Railway Terminus

Rath
type: NamedIndividual
type: StructureFunction
has typical form: Ruin
comment: The function Rath

Recreational Complex
type: NamedIndividual
type: BuildingSingleFunction
has typical form: Building General
comment: The function Recreational Complex

Rectory
type: NamedIndividual
type: BuildingSingleFunction
has typical form: Building General
comment: The function Rectory

Recycling Centre/Depot
type: NamedIndividual
type: BuildingSingleFunction
has typical form: Building General
comment: The function Recycling Centre/Depot

Recycling Plant
type: NamedIndividual
type: BuildingSingleFunction
has typical form: Building General
comment: The function Recycling Plant

Relay Station
type: NamedIndividual
type: BuildingSingleFunction
has typical form: Building General
comment: The function Relay Station

Research Centre
type: NamedIndividual
type: BuildingSingleFunction
has typical form: Building General
comment: The function Research Centre

Research Institute
type: NamedIndividual
type: BuildingSingleFunction
has typical form: Building General
comment: The function Research Institute

Research Laboratory
type: NamedIndividual
type: BuildingSingleFunction
has typical form: Building General
comment: The function Research Laboratory

Reservoir
type: NamedIndividual
type: WaterFunction
has typical form: Lake
comment: The function Reservoir

Residence
type: NamedIndividual
type: BuildingSingleFunction
type: StructureFunction
has typical form: Detached Building
has typical form: End of Terrace
has typical form: Apartment Building
has typical form: Tower Martello
has typical form: Semi-Detached Building
has typical form: Terraced Building
has typical form: Mobile Home/Caravan
has typical form: Gate Lodge
has typical form: Duplex
has typical form: Building General
comment: The function Residence

Restaurant
type: NamedIndividual
type: BuildingSingleFunction
has typical form: Building General
comment: The function Restaurant

Retaining
type: NamedIndividual
type: DivisionLineFunction
has typical form: Wall
comment: The function Retaining

Retirement Home
type: NamedIndividual
type: BuildingSingleFunction
has typical form: Building General
comment: The function Retirement Home

Army Barracks
type: NamedIndividual
type: BuildingSingleFunction
has typical form: Barrack
comment: The function Army Barracks

Ringfort
type: NamedIndividual
type: StructureFunction
has typical form: Landform
comment: The function Ringfort

Change River to Canal
type: NamedIndividual
type: WaterFunction
has typical form: Segment Point
comment: The function Change River to Canal

Rock
type: NamedIndividual
type: StructureFunction
has typical form: Ruin
comment: The function Rock

Art Gallery
type: NamedIndividual
type: BuildingSingleFunction
has typical form: Building General
comment: The function Art Gallery

Round Tower
type: NamedIndividual
type: StructureFunction
has typical form: Ruin
comment: The function Round Tower

Rugby Ground
type: NamedIndividual
type: SiteFunction
has typical form: Sports Ground
comment: The function Rugby Ground

RVR Radar
type: NamedIndividual
type: StructureFunction
has typical form: Air Transmitter Beacon
comment: The function RVR Radar

Sand and Gravel Pit
type: NamedIndividual
type: ExposedSurfaceFunction
has typical form: Pit
comment: The function Sand and Gravel Pit

Sand Pit
type: NamedIndividual
type: ExposedSurfaceFunction
has typical form: Pit
comment: The function Sand Pit

Auction House
type: NamedIndividual
type: BuildingSingleFunction
has typical form: Building General
comment: The function Auction House

Sand Quarry
type: NamedIndividual
type: ExposedSurfaceFunction
has typical form: Quarry
comment: The function Sand Quarry

School
type: NamedIndividual
type: StructureFunction
has typical form: Ruin
comment: The function School

Yard School
type: NamedIndividual
type: ArtificialSurfaceFunction
has typical form: Man-made Surface
comment: The function Yard School

Yard Scrap
type: NamedIndividual
type: ArtificialSurfaceFunction
has typical form: Man-made Surface
comment: The function Yard Scrap

Sculpture
type: NamedIndividual
type: StructureFunction
has typical form: Monument
comment: The function Sculpture

Second Class
type: NamedIndividual
type: WayFunction
has typical form: Dual Carriageway
has typical form: Motorway
has typical form: Roundabout
has typical form: Single Carriageway
has typical form: Sliproad
has typical form: Link Road
comment: The function Second Class

Bakery
type: NamedIndividual
type: BuildingSingleFunction
has typical form: Building General
comment: The function Bakery

Secondary School
type: NamedIndividual
type: BuildingSingleFunction
type: SiteFunction
has typical form: School
comment: The function Secondary School

Sewage Settlement Tank
type: NamedIndividual
type: StructureFunction
has typical form: Tank
comment: The function Sewage Settlement Tank

Sheltered Accommodation
type: NamedIndividual
type: BuildingSingleFunction
has typical form: Building General
comment: The function Sheltered Accommodation

Side of Slope
type: NamedIndividual
type: StructureFunction
has typical form: Landform Line
comment: The function Side of Slope

Bank
type: NamedIndividual
type: BuildingSingleFunction
has typical form: Building General
comment: The function Bank

Silo
type: NamedIndividual
type: StructureFunction
has typical form: Tank
comment: The function Silo

Change Single Stream to River
type: NamedIndividual
type: WaterFunction
has typical form: Segment Point
comment: The function Change Single Stream to River

Change Single Stream to Stream
type: NamedIndividual
type: WaterFunction
has typical form: Segment Point
comment: The function Change Single Stream to Stream

Barrier
type: NamedIndividual
type: DivisionLineFunction
has typical form: Fence
has typical form: Bank
has typical form: Railing
has typical form: Wall
has typical form: Gabion Wall
has typical form: Gate
comment: The function Barrier

Slate Quarry
type: NamedIndividual
type: ExposedSurfaceFunction
has typical form: Quarry
comment: The function Slate Quarry

Soccer Ground
type: NamedIndividual
type: SiteFunction
has typical form: Sports Ground
comment: The function Soccer Ground

Special Needs School
type: NamedIndividual
type: BuildingSingleFunction
type: SiteFunction
has typical form: School
comment: The function Special Needs School

Sports Arena
type: NamedIndividual
type: ArtificialSurfaceFunction
has typical form: Man-made Surface
comment: The function Sports Arena

Yard Stable
type: NamedIndividual
type: ArtificialSurfaceFunction
has typical form: Man-made Surface
comment: The function Yard Stable

State Government
type: NamedIndividual
type: SiteFunction
has typical form: Government Complex
comment: The function State Government

Statue
type: NamedIndividual
type: StructureFunction
has typical form: Monument
comment: The function Statue

Stone Circle
type: NamedIndividual
type: SiteFunction
has typical form: Antiquity
comment: The function Stone Circle

Stone Cross
type: NamedIndividual
type: StructureFunction
has typical form: Ruin
comment: The function Stone Cross

Basketball Arena
type: NamedIndividual
type: BuildingSingleFunction
has typical form: Building General
comment: The function Basketball Arena

Stone Quarry
type: NamedIndividual
type: ExposedSurfaceFunction
has typical form: Quarry
comment: The function Stone Quarry

Swimming Pool
type: NamedIndividual
type: BuildingSingleFunction
has typical form: Building General
comment: The function Swimming Pool

Synagogue
type: NamedIndividual
type: BuildingSingleFunction
has typical form: Building General
comment: The function Synagogue

Teacher Training College
type: NamedIndividual
type: BuildingSingleFunction
type: SiteFunction
has typical form: College
comment: The function Teacher Training College

Telecommunication
type: NamedIndividual
type: BuildingSingleFunction
type: StructureFunction
has typical form: Utility Box
has typical form: Building General
comment: The function Telecommunication

Telephone Exchange
type: NamedIndividual
type: BuildingSingleFunction
has typical form: Building General
comment: The function Telephone Exchange

Telephone Pole
type: NamedIndividual
type: StructureFunction
has typical form: Pole
comment: The function Telephone Pole

Television Station
type: NamedIndividual
type: BuildingSingleFunction
has typical form: Building General
comment: The function Television Station

Theatre
type: NamedIndividual
type: BuildingSingleFunction
has typical form: Building General
comment: The function Theatre

Third Class
type: NamedIndividual
type: WayFunction
has typical form: Dual Carriageway
has typical form: Level Crossing
has typical form: Roundabout
has typical form: Single Carriageway
has typical form: Sliproad
has typical form: Link Road
comment: The function Third Class

Third Level
type: NamedIndividual
type: BuildingSingleFunction
type: SiteFunction
has typical form: College
comment: The function Third Level

Top of Slope
type: NamedIndividual
type: StructureFunction
has typical form: Landform Line
comment: The function Top of Slope

Tourist Office
type: NamedIndividual
type: BuildingSingleFunction
has typical form: Building General
comment: The function Tourist Office

Tower
type: NamedIndividual
type: StructureFunction
has typical form: Ruin
comment: The function Tower

Town Hall
type: NamedIndividual
type: BuildingSingleFunction
has typical form: Building General
comment: The function Town Hall

Transformer Pole
type: NamedIndividual
type: StructureFunction
has typical form: Pole
comment: The function Transformer Pole

Tumulus
type: NamedIndividual
type: StructureFunction
has typical form: Landform
comment: The function Tumulus

Turret
type: NamedIndividual
type: StructureFunction
has typical form: Ruin
comment: The function Turret

University
type: NamedIndividual
type: BuildingSingleFunction
type: SiteFunction
has typical form: College
comment: The function University

Unknown
type: NamedIndividual
type: ArtificialSurfaceFunction
type: BuildingSingleFunction
type: ExposedSurfaceFunction
type: ServiceLineFunction
type: SiteFunction
type: VegetationFunction
has typical form: Grass/Clay Surface
has typical form: Hospital
has typical form: Hospital Complex
has typical form: Powerline Overhead Electricity
has typical form: Pipeline Overhead
has typical form: Quarry
has typical form: School
has typical form: Sports Ground
has typical form: Tower General
has typical form: Man-made Surface
has typical form: Building General
has typical form: Church
has typical form: College
comment: The function Unknown

Unmanaged Woodland
type: NamedIndividual
type: VegetationFunction
has typical form: Woodland Deciduous
has typical form: Woodland Mixed
has typical form: Woodland Coniferous
comment: The function Unmanaged Woodland

Yard Utility
type: NamedIndividual
type: ArtificialSurfaceFunction
has typical form: Man-made Surface
comment: The function Yard Utility

Veterinarian Clinic
type: NamedIndividual
type: BuildingSingleFunction
has typical form: Building General
comment: The function Veterinarian Clinic

Viaduct
type: NamedIndividual
type: StructureFunction
has typical form: Bridge Fixed
comment: The function Viaduct

Visually Impaired School
type: NamedIndividual
type: BuildingSingleFunction
type: SiteFunction
has typical form: School
comment: The function Visually Impaired School

Wall Ruin
type: NamedIndividual
type: StructureFunction
has typical form: Ruin
comment: The function Wall Ruin

Warehouse
type: NamedIndividual
type: BuildingSingleFunction
has typical form: Building General
comment: The function Warehouse

Watch Tower
type: NamedIndividual
type: BuildingSingleFunction
has typical form: Tower General
comment: The function Watch Tower

Water Tank Covered
type: NamedIndividual
type: StructureFunction
has typical form: Tank
comment: The function Water Tank Covered

Water Tank Open
type: NamedIndividual
type: StructureFunction
has typical form: Tank
comment: The function Water Tank Open

Water Tunnel
type: NamedIndividual
type: StructureFunction
has typical form: Tunnel
comment: The function Water Tunnel

Wave Turbine
type: NamedIndividual
type: StructureFunction
has typical form: Turbine
comment: The function Wave Turbine

Way Tunnel
type: NamedIndividual
type: StructureFunction
has typical form: Tunnel
comment: The function Way Tunnel

Wind Turbine
type: NamedIndividual
type: StructureFunction
has typical form: Turbine
comment: The function Wind Turbine

Windmill
type: NamedIndividual
type: StructureFunction
has typical form: Ruin
comment: The function Windmill

Crash Barrier
type: NamedIndividual
type: DivisionLineFunction
has typical form: Fence
has typical form: Railing
has typical form: Wall
comment: The function Crash Barrier

Security Barrier
type: NamedIndividual
type: DivisionLineFunction
has typical form: Fence
has typical form: Railing
comment: The function Security Barrier

Yard Boat
type: NamedIndividual
type: ArtificialSurfaceFunction
has typical form: Man-made Surface
comment: The function Yard Boat

Soccer Stadium
type: NamedIndividual
type: SiteFunction
has typical form: Sports Stadium
comment: The function Soccer Stadium

Aqueduct
type: NamedIndividual
type: StructureFunction
has typical form: Bridge Fixed
comment: The function Aqueduct

Field Rough Pasture
type: NamedIndividual
type: VegetationFunction
has typical form: Grass/Clay Surface
comment: The function Field Rough Pasture

Public Park
type: NamedIndividual
type: SiteFunction
has typical form: Park Enclosed
comment: The function Public Park

Tennis Ground
type: NamedIndividual
type: SiteFunction
has typical form: Sports Ground
comment: The function Tennis Ground

Apron
type: NamedIndividual
type: ArtificialSurfaceFunction
has typical form: Man-made Surface
comment: The function Apron

Area Under Construction
type: NamedIndividual
type: ArtificialSurfaceFunction
has typical form: Man-made Surface
comment: The function Area Under Construction

Athletic Track
type: NamedIndividual
type: ArtificialSurfaceFunction
type: VegetationFunction
has typical form: Grass/Clay Surface
has typical form: Man-made Surface
comment: The function Athletic Track

Basketball Court
type: NamedIndividual
type: ArtificialSurfaceFunction
has typical form: Man-made Surface
comment: The function Basketball Court

BMX Track
type: NamedIndividual
type: ArtificialSurfaceFunction
has typical form: Man-made Surface
comment: The function BMX Track

Bowling Green
type: NamedIndividual
type: VegetationFunction
has typical form: Grass/Clay Surface
comment: The function Bowling Green

Brickworks
type: NamedIndividual
type: ArtificialSurfaceFunction
has typical form: Man-made Surface
comment: The function Brickworks

Built Environment
type: NamedIndividual
type: ArtificialSurfaceFunction
has typical form: Man-made Surface
comment: The function Built Environment

Car Park
type: NamedIndividual
type: ArtificialSurfaceFunction
has typical form: Man-made Surface
comment: The function Car Park

Cement Works
type: NamedIndividual
type: ArtificialSurfaceFunction
has typical form: Man-made Surface
comment: The function Cement Works

Concrete/Gravel/Tarred/Artificial Area
type: NamedIndividual
type: ArtificialSurfaceFunction
has typical form: Man-made Surface
comment: The function Concrete/Gravel/Tarred/Artificial Area

Cycling Track
type: NamedIndividual
type: ArtificialSurfaceFunction
has typical form: Man-made Surface
comment: The function Cycling Track

Dog Racing Track
type: NamedIndividual
type: ArtificialSurfaceFunction
has typical form: Man-made Surface
comment: The function Dog Racing Track

Bottom of Slope
type: NamedIndividual
type: StructureFunction
has typical form: Landform Line
comment: The function Bottom of Slope

Forecourt
type: NamedIndividual
type: ArtificialSurfaceFunction
has typical form: Man-made Surface
comment: The function Forecourt

Garden
type: NamedIndividual
type: ArtificialSurfaceFunction
has typical form: Man-made Surface
comment: The function Garden

Gateway
type: NamedIndividual
type: ArtificialSurfaceFunction
has typical form: Man-made Surface
comment: The function Gateway

Handball Alley
type: NamedIndividual
type: ArtificialSurfaceFunction
has typical form: Man-made Surface
comment: The function Handball Alley

Helipad
type: NamedIndividual
type: ArtificialSurfaceFunction
has typical form: Man-made Surface
comment: The function Helipad

Horse Racing Track
type: NamedIndividual
type: ArtificialSurfaceFunction
has typical form: Man-made Surface
comment: The function Horse Racing Track

Karting Track
type: NamedIndividual
type: ArtificialSurfaceFunction
has typical form: Man-made Surface
comment: The function Karting Track

Lay-by
type: NamedIndividual
type: ArtificialSurfaceFunction
has typical form: Man-made Surface
comment: The function Lay-by

Motor Racing Track
type: NamedIndividual
type: ArtificialSurfaceFunction
has typical form: Man-made Surface
comment: The function Motor Racing Track

Pitch GAA
type: NamedIndividual
type: ArtificialSurfaceFunction
type: VegetationFunction
has typical form: Grass/Clay Surface
has typical form: Man-made Surface
comment: The function Pitch GAA

Pitch Hockey
type: NamedIndividual
type: ArtificialSurfaceFunction
type: VegetationFunction
has typical form: Grass/Clay Surface
has typical form: Man-made Surface
comment: The function Pitch Hockey

Pitch Rugby
type: NamedIndividual
type: VegetationFunction
has typical form: Grass/Clay Surface
comment: The function Pitch Rugby

Pitch Soccer
type: NamedIndividual
type: ArtificialSurfaceFunction
type: VegetationFunction
has typical form: Grass/Clay Surface
has typical form: Man-made Surface
comment: The function Pitch Soccer

Playground
type: NamedIndividual
type: ArtificialSurfaceFunction
has typical form: Man-made Surface
comment: The function Playground

Quay/Wharf
type: NamedIndividual
type: ArtificialSurfaceFunction
has typical form: Man-made Surface
comment: The function Quay/Wharf

Rail Bed
type: NamedIndividual
type: ArtificialSurfaceFunction
has typical form: Man-made Surface
comment: The function Rail Bed

Rail Turntable
type: NamedIndividual
type: ArtificialSurfaceFunction
has typical form: Man-made Surface
comment: The function Rail Turntable

Rail Verge
type: NamedIndividual
type: ArtificialSurfaceFunction
type: VegetationFunction
has typical form: Grass/Clay Surface
has typical form: Man-made Surface
comment: The function Rail Verge

Ramp
type: NamedIndividual
type: ArtificialSurfaceFunction
has typical form: Man-made Surface
comment: The function Ramp

Rest Area
type: NamedIndividual
type: ArtificialSurfaceFunction
has typical form: Man-made Surface
comment: The function Rest Area

Road Verge
type: NamedIndividual
type: ArtificialSurfaceFunction
type: VegetationFunction
has typical form: Grass/Clay Surface
has typical form: Man-made Surface
comment: The function Road Verge

Roundabout
type: NamedIndividual
type: ArtificialSurfaceFunction
type: VegetationFunction
has typical form: Grass/Clay Surface
has typical form: Man-made Surface
comment: The function Roundabout

Service Area
type: NamedIndividual
type: ArtificialSurfaceFunction
has typical form: Man-made Surface
comment: The function Service Area

Serviced Halting Site
type: NamedIndividual
type: ArtificialSurfaceFunction
has typical form: Man-made Surface
comment: The function Serviced Halting Site

Sewage
type: NamedIndividual
type: ArtificialSurfaceFunction
has typical form: Man-made Surface
comment: The function Sewage

Sidewalk
type: NamedIndividual
type: ArtificialSurfaceFunction
has typical form: Man-made Surface
comment: The function Sidewalk

Silage Pit
type: NamedIndividual
type: ArtificialSurfaceFunction
has typical form: Man-made Surface
comment: The function Silage Pit

Skate Park
type: NamedIndividual
type: ArtificialSurfaceFunction
has typical form: Man-made Surface
comment: The function Skate Park

Bowling Alley
type: NamedIndividual
type: BuildingSingleFunction
has typical form: Building General
comment: The function Bowling Alley

Slipway
type: NamedIndividual
type: ArtificialSurfaceFunction
has typical form: Man-made Surface
comment: The function Slipway

Sloping Masonry
type: NamedIndividual
type: ArtificialSurfaceFunction
has typical form: Man-made Surface
comment: The function Sloping Masonry

Slurry Pit
type: NamedIndividual
type: ArtificialSurfaceFunction
has typical form: Man-made Surface
comment: The function Slurry Pit

Sports Surface Multiple Use
type: NamedIndividual
type: ArtificialSurfaceFunction
has typical form: Man-made Surface
comment: The function Sports Surface Multiple Use

Tailing
type: NamedIndividual
type: ArtificialSurfaceFunction
has typical form: Man-made Surface
comment: The function Tailing

Tennis Court
type: NamedIndividual
type: ArtificialSurfaceFunction
type: VegetationFunction
has typical form: Grass/Clay Surface
has typical form: Man-made Surface
comment: The function Tennis Court

Traffic Island
type: NamedIndividual
type: ArtificialSurfaceFunction
type: VegetationFunction
has typical form: Grass/Clay Surface
has typical form: Man-made Surface
comment: The function Traffic Island

Inner Wall
type: NamedIndividual
type: DivisionLineFunction
has typical form: Wall
comment: The function Inner Wall

Open Wall
type: NamedIndividual
type: DivisionLineFunction
has typical form: Wall
comment: The function Open Wall

Brewery
type: NamedIndividual
type: BuildingSingleFunction
has typical form: Building General
comment: The function Brewery

Rail Junction
type: NamedIndividual
type: RailNodeFunction
has typical form: Segment Point
comment: The function Rail Junction

Golf Course 9 Hole
type: NamedIndividual
type: SiteFunction
has typical form: Golf Course
comment: The function Golf Course 9 Hole

Golf Course 18 Hole
type: NamedIndividual
type: SiteFunction
has typical form: Golf Course
comment: The function Golf Course 18 Hole

Golf Course 27 Hole
type: NamedIndividual
type: SiteFunction
has typical form: Golf Course
comment: The function Golf Course 27 Hole

Golf Course 36 Hole
type: NamedIndividual
type: SiteFunction
has typical form: Golf Course
comment: The function Golf Course 36 Hole

Grassland Rough Pasture
type: NamedIndividual
type: VegetationFunction
has typical form: Grass/Clay Surface
comment: The function Grassland Rough Pasture

Gallops
type: NamedIndividual
type: VegetationFunction
has typical form: Grass/Clay Surface
comment: The function Gallops

Golf Driving Range
type: NamedIndividual
type: VegetationFunction
has typical form: Grass/Clay Surface
comment: The function Golf Driving Range

Green Space
type: NamedIndividual
type: VegetationFunction
has typical form: Grass/Clay Surface
comment: The function Green Space

Parkland
type: NamedIndividual
type: VegetationFunction
has typical form: Grass/Clay Surface
comment: The function Parkland

220Kv
type: NamedIndividual
type: ServiceLineFunction
has typical form: Powerline Overhead Electricity
comment: The function 220Kv

Pitch and Putt 18 Hole
type: NamedIndividual
type: SiteFunction
has typical form: Pitch and Putt
comment: The function Pitch and Putt 18 Hole

Pitch Cricket
type: NamedIndividual
type: VegetationFunction
has typical form: Grass/Clay Surface
comment: The function Pitch Cricket

Race Track
type: NamedIndividual
type: VegetationFunction
has typical form: Grass/Clay Surface
comment: The function Race Track

Showground
type: NamedIndividual
type: VegetationFunction
has typical form: Grass/Clay Surface
comment: The function Showground

Sports Ground
type: NamedIndividual
type: VegetationFunction
has typical form: Grass/Clay Surface
comment: The function Sports Ground

Water Junction
type: NamedIndividual
type: WaterFunction
has typical form: Segment Point
comment: The function Water Junction

Sports Surface
type: NamedIndividual
type: ArtificialSurfaceFunction
has typical form: Man-made Surface
comment: The function Sports Surface

Sports Ground Multiple Use
type: NamedIndividual
type: VegetationFunction
has typical form: Grass/Clay Surface
comment: The function Sports Ground Multiple Use

Top of Sloping Masonry
type: NamedIndividual
type: StructureFunction
has typical form: Man-made Surface
comment: The function Top of Sloping Masonry

Top of Waterfall
type: NamedIndividual
type: StructureFunction
has typical form: Waterfall
comment: The function Top of Waterfall

Top of Weir
type: NamedIndividual
type: StructureFunction
has typical form: Weir
comment: The function Top of Weir

Top of Rock Face
type: NamedIndividual
type: StructureFunction
has typical form: Rock Face
comment: The function Top of Rock Face

Golf Course
type: NamedIndividual
type: VegetationFunction
has typical form: Grass/Clay Surface
comment: The function Golf Course

Golf Links
type: NamedIndividual
type: VegetationFunction
has typical form: Grass/Clay Surface
comment: The function Golf Links

Pitch and Putt
type: NamedIndividual
type: VegetationFunction
has typical form: Grass/Clay Surface
comment: The function Pitch and Putt

Building Ruin
type: NamedIndividual
type: SiteFunction
type: StructureFunction
has typical form: Ruin
comment: The function Building Ruin

Gate Tower
type: NamedIndividual
type: BuildingSingleFunction
has typical form: Tower General
comment: The function Gate Tower

Church Tower
type: NamedIndividual
type: BuildingSingleFunction
has typical form: Tower General
comment: The function Church Tower

Not Applicable
type: NamedIndividual
type: ArtificialSurfaceFunction
type: BuildingGroupFunction
type: BuildingSingleFunction
type: BuildingUnitFunction
type: DivisionLineFunction
type: ExposedSurfaceFunction
type: RailNodeFunction
type: SiteFunction
type: StructureFunction
type: VegetationFunction
type: WaterFunction
type: WayFunction
has typical form: Abbey
has typical form: Courthouse Complex
has typical form: Crane
has typical form: Crane Rail
has typical form: Dam
has typical form: Amusement Park
has typical form: Dock
has typical form: Dog Racing Venue
has typical form: Drain
has typical form: Enclosed Traffic Area
has typical form: End of Rail
has typical form: End of Terrace
has typical form: Entrance or Exit Car Park
has typical form: Entrance or Exit Generic
has typical form: Entrance or Exit Service Area
has typical form: Equestrian Centre
has typical form: Ferry Terminal
has typical form: Filling Station
has typical form: Fire Station
has typical form: Flat Rock
has typical form: Apartment
has typical form: Fountain
has typical form: Friary
has typical form: Gallops
has typical form: Garda Complex
has typical form: Garda Station
has typical form: Apartment Building
has typical form: Gas Complex
has typical form: Glasshouse
has typical form: Grass/Clay Surface
has typical form: Grandstand
has typical form: Handball Alley
has typical form: Heath
has typical form: Approach Light
has typical form: Heritage Park
has typical form: Holiday Centre
has typical form: Hotel
has typical form: Hotel Complex
has typical form: Interchange
has typical form: Lake Intersecting Point
has typical form: Jetty
has typical form: Lake
has typical form: Landfill
has typical form: Aquatic Centre
has typical form: Level Crossing
has typical form: Library
has typical form: Lifeboat Station
has typical form: Lighthouse
has typical form: Lock Gate
has typical form: Mansion
has typical form: Manufacturing Unit
has typical form: Marsh
has typical form: Mast
has typical form: Archway
has typical form: Mile Post
has typical form: Mill
has typical form: Mill Race
has typical form: Monastery
has typical form: Monument
has typical form: Mooring Post
has typical form: Mosque
has typical form: Motor Racing Circuit
has typical form: Mud
has typical form: Multiple Use
has typical form: Multi-Storey Car park
has typical form: Museum
has typical form: Naval Base

Office
type: NamedIndividual
type: BuildingSingleFunction
has typical form: Building General
comment: The function Office

Commercial/Retail
type: NamedIndividual
type: BuildingSingleFunction
has typical form: Building General
comment: The function Commercial/Retail

Industrial facility
type: NamedIndividual
type: BuildingSingleFunction
has typical form: Building General
comment: The function Industrial facility

Bus Shelter
type: NamedIndividual
type: StructureFunction
has typical form: Canopy
comment: The function Bus Shelter

Bullaun
type: NamedIndividual
type: StructureFunction
has typical form: Ruin
comment: The function Bullaun

Carport
type: NamedIndividual
type: StructureFunction
has typical form: Canopy
comment: The function Carport

Bicycle Shelter
type: NamedIndividual
type: StructureFunction
has typical form: Canopy
comment: The function Bicycle Shelter

Covered Walkway
type: NamedIndividual
type: StructureFunction
has typical form: Canopy
comment: The function Covered Walkway

Bandstand
type: NamedIndividual
type: StructureFunction
has typical form: Canopy
comment: The function Bandstand

Building Overhang
type: NamedIndividual
type: StructureFunction
has typical form: Canopy
comment: The function Building Overhang

Covered Sports Terrace
type: NamedIndividual
type: StructureFunction
has typical form: Canopy
comment: The function Covered Sports Terrace

Toll Booth
type: NamedIndividual
type: StructureFunction
has typical form: Canopy
comment: The function Toll Booth

Commercial, Livestock, Fruit, Vegetable and Fish
type: NamedIndividual
type: BuildingSingleFunction
has typical form: Market
comment: The function Commercial, Livestock, Fruit, Vegetable and Fish

Further Education
type: NamedIndividual
type: BuildingSingleFunction
has typical form: College
comment: The function Further Education

Burial Ground
type: NamedIndividual
type: VegetationFunction
has typical form: Grass/Clay Surface
comment: The function Burial Ground

Not Defined
type: NamedIndividual
type: StructureFunction
has typical form: Pole
comment: The function Not Defined

Primary and Secondary School
type: NamedIndividual
type: BuildingSingleFunction
has typical form: School
comment: The function Primary and Secondary School

Parking Bay
type: NamedIndividual
type: ArtificialSurfaceFunction
has typical form: Man-made Surface
comment: The function Parking Bay

Plaza Ornamental
type: NamedIndividual
type: ArtificialSurfaceFunction
has typical form: Man-made Surface
comment: The function Plaza Ornamental

Turning Circle
type: NamedIndividual
type: ArtificialSurfaceFunction
has typical form: Man-made Surface
comment: The function Turning Circle

Third Class (Access Only)
type: NamedIndividual
type: WayFunction
has typical form: Single Carriageway
comment: The function Third Class (Access Only)

Burial Place
type: NamedIndividual
type: SiteFunction
has typical form: Cemetery
comment: The function Burial Place

Bus Depot
type: NamedIndividual
type: ArtificialSurfaceFunction
type: BuildingSingleFunction
has typical form: Man-made Surface
has typical form: Building General
comment: The function Bus Depot

Bus Station
type: NamedIndividual
type: BuildingSingleFunction
has typical form: Building General
comment: The function Bus Station

Cairn
type: NamedIndividual
type: StructureFunction
has typical form: Landform
has typical form: Ruin
comment: The function Cairn

Castle
type: NamedIndividual
type: StructureFunction
has typical form: Ruin
comment: The function Castle

Cathedral
type: NamedIndividual
type: SiteFunction
type: StructureFunction
has typical form: Antiquity
has typical form: Ruin
comment: The function Cathedral

275Kv
type: NamedIndividual
type: ServiceLineFunction
has typical form: Powerline Overhead Electricity
comment: The function 275Kv

Catholic Cathedral
type: NamedIndividual
type: BuildingSingleFunction
type: SiteFunction
has typical form: Church
comment: The function Catholic Cathedral

Catholic Church
type: NamedIndividual
type: BuildingSingleFunction
type: SiteFunction
has typical form: Church
comment: The function Catholic Church

Cemetery
type: NamedIndividual
type: VegetationFunction
has typical form: Grass/Clay Surface
comment: The function Cemetery

Chapel
type: NamedIndividual
type: StructureFunction
has typical form: Ruin
comment: The function Chapel

Childrens Home
type: NamedIndividual
type: BuildingSingleFunction
has typical form: Building General
comment: The function Childrens Home

Childrens Hospital
type: NamedIndividual
type: BuildingSingleFunction
type: SiteFunction
has typical form: Hospital
has typical form: Hospital Complex
comment: The function Childrens Hospital

Church
type: NamedIndividual
type: SiteFunction
type: StructureFunction
has typical form: Antiquity
has typical form: Ruin
comment: The function Church

Church of Ireland Church
type: NamedIndividual
type: BuildingSingleFunction
type: SiteFunction
has typical form: Church
comment: The function Church of Ireland Church

Church of Ireland Cathedral
type: NamedIndividual
type: BuildingSingleFunction
type: SiteFunction
has typical form: Church
comment: The function Church of Ireland Cathedral

Cill
type: NamedIndividual
type: StructureFunction
has typical form: Ruin
comment: The function Cill

Cillin
type: NamedIndividual
type: VegetationFunction
has typical form: Grass/Clay Surface
comment: The function Cillin

Cinema
type: NamedIndividual
type: BuildingSingleFunction
has typical form: Building General
comment: The function Cinema

Civil Defence
type: NamedIndividual
type: BuildingSingleFunction
has typical form: Building General
comment: The function Civil Defence

Clinic
type: NamedIndividual
type: BuildingSingleFunction
has typical form: Building General
comment: The function Clinic